Makx Dekkers
type: Person

World Wide Web Consortium (W3C)
type: Organization

David Browning
type: Person

Peter Winstanley
type: Person

Simon J D Cox
type: Person
member of: Commonwealth Scientific and Industrial Research Organisation
work info homepage: http://people.csiro.au/Simon-Cox

Andrea Perego
type: Person

Riccardo Albertoni
type: Person

Alejandra Gonzalez-Beltran
type: Person
member of: Science and Technology Facilities Council, UK

Jakub Klímek
type: Person

Anna Odgaard Ingram
type: Person

Vassilios Peristeras
type: Person
member of: European Commission, DG DIGIT

Fadi Maali
type: Person
member of: DERI, NUI Galway

Shuji Kamitsuna
type: Person

David Browning
type: Person

Peter Winstanley
type: Person

Simon J D Cox
type: Person
work info homepage: http://people.csiro.au/Simon-Cox

Andrea Perego
type: Person

Anna Odgaard Ingram
type: Person

Vassilios Peristeras
type: Person

Fadi Maali
type: Person

dcat
type: NamedIndividual
has version: dcat2
has version: dcat2014
has version: dcat3
previous version: dcat2
version: 3

Catalog
type: Class
comment: A curated collection of metadata about resources (e.g., datasets and data services in the context of a data catalog).
comment: En udvalgt og arrangeret samling af metadata om ressourcer (fx datasæt og datatjenester i kontekst af et datakatalog). @da
comment: Una colección curada de metadatos sobre recursos (por ejemplo, conjuntos de datos y servicios de datos en el contexto de un catálogo de datos). @es
comment: Una raccolta curata di metadati sulle risorse (ad es. sui dataset e relativi servizi nel contesto di cataloghi di dati). @it
comment: Une collection élaborée de métadonnées sur les jeux de données @fr
comment: Řízená kolekce metadat o datových sadách a datových službách @cs
comment: Μια επιμελημένη συλλογή μεταδεδομένων περί συνόλων δεδομένων @el
comment: مجموعة من توصيفات قوائم البيانات @ar
comment: データ・カタログは、データセットに関するキュレートされたメタデータの集合です。 @ja
label: Catalogo @it
label: Catalogue @fr
label: Catálogo @es
label: Katalog @cs
label: Κατάλογος @el
label: فهرس قوائم البيانات @ar
label: カタログ @ja
subclass of: Dataset
definition: A curated collection of metadata about resources.
definition: En samling af metadata om ressourcer. @da
definition: Una colección curada de metadatos sobre recursos. @es
definition: Una raccolta curata di metadati sulle risorse. @it
definition: Une collection élaborée de métadonnées sur les jeux de données. @fr
definition: Řízená kolekce metadat o datových sadách a datových službách. @cs
definition: Μια επιμελημένη συλλογή μεταδεδομένων περί συνόλων δεδομένων. @el
editorial note: Multilingual text not completelly updated. Translations for skos:scopeNote and definitions to doublecheck.
scope note: A web-based data catalog is typically represented as a single instance of this class.
scope note: Datasets and data services are examples of resources in the context of a data catalog.
scope note: Et webbaseret datakatalog repræsenteres typisk ved en enkelt instans af denne klasse. @da
scope note: Normalmente, un catalogo di dati nel web viene rappresentato come una singola istanza di questa classe. @it
scope note: Normalmente, un catálogo de datos disponible en la web se representa como una única instancia de esta clase. @es
scope note: Webový datový katalog je typicky reprezentován jako jedna instance této třídy. @cs
scope note: Συνήθως, ένας κατάλογος δεδομένων στον Παγκόσμιο Ιστό αναπαρίσταται ως ένα στιγμιότυπο αυτής της κλάσης. @el
scope note: 通常、ウェブ・ベースのデータ・カタログは、このクラスの1つのインスタンスとして表わされます。 @ja

Catalog Record
type: Class
comment: 1つのデータセットを記述したデータ・カタログ内のレコード。 @ja
comment: A record in a data catalog, describing the registration of a single dataset or data service.
comment: En post i et datakatalog der beskriver registreringen af et enkelt datasæt eller en datatjeneste. @da
comment: Un record in un catalogo di dati che descrive un singolo dataset o servizio di dati. @it
comment: Un registre du catalogue ou une entrée du catalogue, décrivant un seul jeu de données. @fr
comment: Un registro en un catálogo de datos que describe un solo conjunto de datos o un servicio de datos. @es
comment: Záznam v datovém katalogu popisující jednu datovou sadu či datovou službu. @cs
comment: Μία καταγραφή ενός καταλόγου, η οποία περιγράφει ένα συγκεκριμένο σύνολο δεδομένων. @el
label: Katalogizační záznam @cs
label: Katalogpost @da
label: Record di catalogo @it
label: Registre du catalogue @fr
label: Registro del catálogo @es
label: Καταγραφή καταλόγου @el
label: سجل @ar
label: カタログ・レコード @ja
subclass of: Restriction
  all values from: Catalogued resource
  on property: primaryTopic
subclass of: Restriction
  cardinality: 1
  on property: primaryTopic
editorial note: English definition updated in this revision. Multilingual text not yet updated except the Spanish one and the Czech one and Italian one.
scope note: C'est une classe facultative et tous les catalogues ne l'utiliseront pas. Cette classe existe pour les catalogues ayant une distinction entre les métadonnées sur le jeu de données et les métadonnées sur une entrée du jeu de données dans le catalogue. @fr
scope note: Denne klasse er valgfri og ikke alle kataloger vil anvende denne klasse. Den kan anvendes i de kataloger hvor der skelnes mellem metadata om datasættet eller datatjenesten og metadata om selve posten til registreringen af datasættet eller datatjenesten i kataloget. Udgivelsesdatoen for datasættet afspejler for eksempel den dato hvor informationerne oprindeligt blev gjort tilgængelige af udgiveren, hvorimod udgivelsesdatoen for katalogposten er den dato hvor datasættet blev føjet til kataloget. I de tilfælde hvor de to datoer er forskellige eller hvor blot sidstnævnte er kendt, bør udgivelsesdatoen kun angives for katalogposten. Bemærk at W3Cs PROV ontologi gør til muligt at tilføje yderligere proveniensoplysninger eksempelvis om processen eller aktøren involveret i en given ændring af datasættet. @da
scope note: Esta clase es opcional y no todos los catálogos la utilizarán. Esta clase existe para catálogos que hacen una distinción entre los metadatos acerca de un conjunto de datos o un servicio de datos y los metadatos acerca de una entrada en ese conjunto de datos en el catálogo. Por ejemplo, la propiedad sobre la fecha de la publicación de los datos refleja la fecha en que la información fue originalmente publicada, mientras que la fecha de publicación del registro del catálogo es la fecha en que los datos se agregaron al mismo. En caso en que ambas fechas fueran diferentes, o en que sólo la fecha de publicación del registro del catálogo estuviera disponible, sólo debe especificarse en el registro del catálogo. Tengan en cuenta que la ontología PROV de W3C permite describir otra información sobre la proveniencia de los datos, como por ejemplo detalles del proceso y de los agentes involucrados en algún cambio específico a los datos. @es
scope note: Questa classe è opzionale e non tutti i cataloghi la utilizzeranno. Esiste per cataloghi in cui si opera una distinzione tra i metadati relativi al dataset ed i metadati relativi alla gestione del dataset nel catalogo. Ad esempio, la proprietà per indicare la data di pubblicazione del dataset rifletterà la data in cui l'informazione è stata originariamente messa a disposizione dalla casa editrice, mentre la data di pubblicazione per il record nel catalogo rifletterà la data in cui il dataset è stato aggiunto al catalogo. Nei casi dove solo quest'ultima sia nota, si utilizzerà esclusivamente la data di pubblicazione relativa al record del catalogo. Si noti che l'Ontologia W3C PROV permette di descrivere ulteriori informazioni sulla provenienza, quali i dettagli del processo, la procedura e l'agente coinvolto in una particolare modifica di un dataset. @it
scope note: Tato třída je volitelná a ne všechny katalogy ji využijí. Existuje pro katalogy, ve kterých se rozlišují metadata datové sady či datové služby a metadata o záznamu o datové sadě či datové službě v katalogu. Například datum publikace datové sady odráží datum, kdy byla datová sada původně zveřejněna poskytovatelem dat, zatímco datum publikace katalogizačního záznamu je datum zanesení datové sady do katalogu. V případech kdy se obě data liší, nebo je známo jen to druhé, by mělo být specifikováno jen datum publikace katalogizačního záznamu. Všimněte si, že ontologie W3C PROV umožňuje popsat další informace o původu jako například podrobnosti o procesu konkrétní změny datové sady a jeho účastnících. @cs
scope note: This class is optional and not all catalogs will use it. It exists for catalogs where a distinction is made between metadata about a dataset or data service and metadata about the entry for the dataset or data service in the catalog. For example, the publication date property of the dataset reflects the date when the information was originally made available by the publishing agency, while the publication date of the catalog record is the date when the dataset was added to the catalog. In cases where both dates differ, or where only the latter is known, the publication date should only be specified for the catalog record. Notice that the W3C PROV Ontology allows describing further provenance information such as the details of the process and the agent involved in a particular change to a dataset.
scope note: Αυτή η κλάση είναι προαιρετική και δεν χρησιμοποιείται από όλους τους καταλόγους. Υπάρχει για τις περιπτώσεις καταλόγων όπου γίνεται διαχωρισμός μεταξύ των μεταδεδομένων για το σύνολο των δεδομένων και των μεταδεδομένων για την καταγραφή του συνόλου δεδομένων εντός του καταλόγου. Για παράδειγμα, η ιδιότητα της ημερομηνίας δημοσίευσης του συνόλου δεδομένων δείχνει την ημερομηνία κατά την οποία οι πληροφορίες έγιναν διαθέσιμες από τον φορέα δημοσίευσης, ενώ η ημερομηνία δημοσίευσης της καταγραφής του καταλόγου δείχνει την ημερομηνία που το σύνολο δεδομένων προστέθηκε στον κατάλογο. Σε περιπτώσεις που οι δύο ημερομηνίες διαφέρουν, ή που μόνο η τελευταία είναι γνωστή, η ημερομηνία δημοσίευσης θα πρέπει να δίνεται για την καταγραφή του καταλόγου. Να σημειωθεί πως η οντολογία W3C PROV επιτρέπει την περιγραφή επιπλέον πληροφοριών ιστορικού όπως λεπτομέρειες για τη διαδικασία και τον δράστη που εμπλέκονται σε μία συγκεκριμένη αλλαγή εντός του συνόλου δεδομένων. @el
scope note: このクラスはオプションで、すべてのカタログがそれを用いるとは限りません。これは、データセットに関するメタデータとカタログ内のデータセットのエントリーに関するメタデータとで区別が行われるカタログのために存在しています。例えば、データセットの公開日プロパティーは、公開機関が情報を最初に利用可能とした日付を示しますが、カタログ・レコードの公開日は、データセットがカタログに追加された日付です。両方の日付が異っていたり、後者だけが分かっている場合は、カタログ・レコードに対してのみ公開日を指定すべきです。W3CのPROVオントロジー[prov-o]を用いれば、データセットに対する特定の変更に関連するプロセスやエージェントの詳細などの、さらに詳しい来歴情報の記述が可能となることに注意してください。 @ja

Data service
type: Class
comment: A site or end-point providing operations related to the discovery of, access to, or processing functions on, data or related resources.
comment: Et websted eller endpoint der udstiller operationer relateret til opdagelse af, adgang til eller behandlende funktioner på data eller relaterede ressourcer. @da
comment: Umístění či přístupový bod poskytující operace související s hledáním, přistupem k, či výkonem funkcí na datech či souvisejících zdrojích. @cs
comment: Un sitio o end-point que provee operaciones relacionadas a funciones de descubrimiento, acceso, o procesamiento de datos o recursos relacionados. @es
comment: Un sito o end-point che fornisce operazioni relative alla scoperta, all'accesso o all'elaborazione di funzioni su dati o risorse correlate. @it
label: Datatjeneste @da
label: Servicio de datos @es
label: Servizio di dati @it
subclass of: Service
subclass of: Catalogued resource
alternative label: Dataservice @da
change note: New class added in DCAT 2.
change note: Nová třída přidaná ve verzi DCAT 2. @cs
change note: Nueva clase añadida en DCAT 2. @es
change note: Nuova classe aggiunta in DCAT 2. @it
change note: Ny klasse tilføjet i DCAT 2. @da
definition: Et site eller endpoint der udstiller operationer relateret til opdagelse af, adgang til eller behandlende funktioner på data eller relaterede ressourcer. @da
scope note: Datatjenestetypen kan indikeres ved hjælp af egenskaben dcterms:type. Værdien kan tages fra kontrollerede udfaldsrum såsom INSPIRE spatial data service vocabulary. @da
scope note: Druh služby může být indikován vlastností dcterms:type. Její hodnota může být z řízeného slovníku, kterým je například slovník typů prostorových datových služeb INSPIRE. @cs
scope note: El tipo de servicio puede indicarse usando la propiedad dcterms:type. Su valor puede provenir de un vocabulario controlado, como por ejemplo el vocabulario de servicios de datos espaciales de INSPIRE. @es
scope note: Hvis en dcat:DataService er bundet til en eller flere specifikke datasæt kan dette indikeres ved hjælp af egenskaben dcat:servesDataset. @da
scope note: If a dcat:DataService is bound to one or more specified Datasets, they are indicated by the dcat:servesDataset property.
scope note: Il tipo di servizio può essere indicato usando la proprietà dcterms:type. Il suo valore può essere preso da un vocabolario controllato come il vocabolario dei tipi di servizi per dati spaziali di INSPIRE. @it
scope note: Pokud je dcat:DataService navázána na jednu či více Datových sad, jsou tyto indikovány vlstností dcat:servesDataset. @cs
scope note: Se un dcat:DataService è associato a uno o più Dataset specificati, questi sono indicati dalla proprietà dcat:serveDataset. @it
scope note: Si un dcat:DataService está asociado con uno o más conjuntos de datos especificados, dichos conjuntos de datos pueden indicarse con la propiedad dcat:servesDataset. @es
scope note: The kind of service can be indicated using the dcterms:type property. Its value may be taken from a controlled vocabulary such as the INSPIRE spatial data service type vocabulary.

Dataset
type: Class
comment: 1つのエージェントによって公開またはキュレートされ、1つ以上の形式でアクセスまたはダウンロードできるデータの集合。 @ja
comment: A collection of data, published or curated by a single source, and available for access or download in one or more representations.
comment: En samling af data, udgivet eller udvalgt og arrangeret af en enkelt kilde og som er til råde for adgang til eller download af i en eller flere repræsentationer. @da
comment: Kolekce dat poskytovaná či řízená jedním zdrojem, která je k dispozici pro přístup či stažení v jednom či více formátech. @cs
comment: Raccolta di dati, pubblicati o curati da un'unica fonte, disponibili per l'accesso o il download in uno o più formati. @it
comment: Una colección de datos, publicados o conservados por una única fuente, y disponibles para ser accedidos o descargados en uno o más formatos. @es
comment: Une collection de données, publiée ou élaborée par une seule source, et disponible pour accès ou téléchargement dans un ou plusieurs formats. @fr
comment: Μία συλλογή από δεδομένα, δημοσιευμένη ή επιμελημένη από μία και μόνο πηγή, διαθέσιμη δε προς πρόσβαση ή μεταφόρτωση σε μία ή περισσότερες μορφές. @el
comment: قائمة بيانات منشورة أو مجموعة من قبل مصدر ما و متاح الوصول إليها أو تحميلها @ar
label: Conjunto de datos @es
label: Datasæt @da
label: Datová sada @cs
label: Jeu de données @fr
label: Σύνολο Δεδομένων @el
label: قائمة بيانات @ar
label: データセット @ja
subclass of: Catalogued resource
equivalent class: Data set
alternative label: Datasamling @da
change note: 2018-02 - odstraněno tvrzení o podtřídě dctype:Dataset, jelikož rozsah dcat:Dataset zahrnuje několik dalších typů ze slovníku dctype. @cs
change note: 2018-02 - se eliminó el axioma de subclase con dctype:Dataset porque el alcance de dcat:Dataset incluye muchos otros tipos del vocabulario dctype. @es
change note: 2018-02 - sottoclasse di dctype:Dataset rimosso perché l'ambito di dcat:Dataset include diversi altri tipi dal vocabolario dctype. @it
change note: 2018-02 - subclass of dctype:Dataset removed because scope of dcat:Dataset includes several other types from the dctype vocabulary.
change note: 2018-02 - subklasse af dctype:Dataset fjernet da scope af dcat:Dataset omfatter flere forskellige typer fra dctype-vokabularet. @da
definition: En samling a data, udgivet eller udvalgt og arrangeret af en enkelt kilde og som der er adgang til i en eller flere repræsentationer. @da
editorial note: 2020-03-16 A new scopenote added and need to be translated
scope note: Cette classe représente le jeu de données publié par le fournisseur de données. Dans les cas où une distinction est nécessaire entre le jeu de donénes et son entrée dans le catalogue, la classe registre de données peut être utilisée pour ce dernier. @fr
scope note: Denne klasse beskriver det konceptuelle datasæt. En eller flere repræsentationer kan være tilgængelige med forskellige skematiske opsætninger, formater eller serialiseringer. @da
scope note: Denne klasse repræsenterer det konkrete datasæt som det udgives af datasætleverandøren. I de tilfælde hvor det er nødvendigt at skelne mellem det konkrete datasæt og dets registrering i kataloget (fordi metadata såsom ændringsdato og vedligeholder er forskellige), så kan klassen katalogpost anvendes. @da
scope note: Esta clase representa el conjunto de datos publicados. En los casos donde es necesario distinguir entre el conjunto de datos y su entrada en el catálogo de datos, se debe utilizar la clase 'registro del catálogo'. @es
scope note: Questa classe descrive il dataset dal punto di vista concettuale. Possono essere disponibili una o più rappresentazioni, con diversi layout e formati schematici o serializzazioni. @it
scope note: Questa classe rappresenta il dataset come pubblicato dall’editore. Nel caso in cui sia necessario operare una distinzione fra i metadati originali del dataset e il record dei metadati ad esso associato nel catalogo (ad esempio, per distinguere la data di modifica del dataset da quella del dataset nel catalogo) si può impiegare la classe catalog record. @it
scope note: Tato třída reprezentuje datovou sadu tak, jak je publikována poskytovatelem dat. V případě potřeby rozlišení datové sady a jejího katalogizačního záznamu (jelikož metadata jako datum modifikace se mohou lišit) pro něj může být použita třída "katalogizační záznam". @cs
scope note: The notion of dataset in DCAT is broad and inclusive, with the intention of accommodating resource types arising from all communities. Data comes in many forms including numbers, text, pixels, imagery, sound and other multi-media, and potentially other types, any of which might be collected into a dataset.
scope note: This class describes the conceptual dataset. One or more representations might be available, with differing schematic layouts and formats or serializations.
scope note: This class represents the actual dataset as published by the dataset provider. In cases where a distinction between the actual dataset and its entry in the catalog is necessary (because metadata such as modification date and maintainer might differ), the catalog record class can be used for the latter.
scope note: Η κλάση αυτή αναπαριστά το σύνολο δεδομένων αυτό καθ'εαυτό, όπως έχει δημοσιευθεί από τον εκδότη. Σε περιπτώσεις όπου είναι απαραίτητος ο διαχωρισμός μεταξύ του συνόλου δεδομένων και της καταγραφής αυτού στον κατάλογο (γιατί μεταδεδομένα όπως η ημερομηνία αλλαγής και ο συντηρητής μπορεί να διαφέρουν) η κλάση της καταγραφής καταλόγου μπορεί να χρησιμοποιηθεί για το τελευταίο. @el
scope note: このクラスは、データセットの公開者が公開する実際のデータセットを表わします。カタログ内の実際のデータセットとそのエントリーとの区別が必要な場合（修正日と維持者などのメタデータが異なるかもしれないので）は、後者にcatalog recordというクラスを使用できます。 @ja

Dataset series
type: Class
comment: A collection of datasets that are published separately, but share some characteristics that group them.
comment: Una colección de conjuntos de datos publicados por separado, pero que comparten características que los agrupan. @es
comment: Una collezione di dataset che sono pubblicati separatamente, ma che condividono caratteristiche che li rendono parte di uno stesso gruppo. @it
label: Serie de conjuntos de datos @es
label: Serie di dataset @it
subclass of: Dataset
change note: New class added in DCAT 3.
change note: Nová třída přidaná ve verzi DCAT 3 @cs
change note: Nueva clase agregada en DCAT 3. @es
change note: Nuova classe aggiunta in DCAT 3 @it
change note: Ny klasse tilføjet i DCAT 3 @da
definition: A collection of datasets that are published separately, but share some common characteristics that groups them.
definition: Una colección de conjuntos de datos publicados por separado, pero que comparten características comunes que los agrupan. @es
editorial note: 2022-05-08 Added to ttl file with annotations in English, Spanish and Italian, except notes that are in other languages too.
scope note: Algunos escenarios comunes para series de conjuntos de datos son: series temporales compuestas de subconjuntos de datos publicados periódicamente; series de mapas compuestos de elementos del mismo tipo o tema pero con distintas huellas espaciales. @es
scope note: Common scenarios for dataset series include: time series composed of periodically released subsets; map-series composed of items of the same type or theme but with differing spatial footprints.
scope note: Dataset series can be also soft-typed via property dcterms:type as in the approach used in [GeoDCAT-AP], and adopted in [DCAT-AP-IT] and [GeoDCAT-AP-IT]).
scope note: Le serie di dati possono anche essere denotate come tali usando la proprietà dcterms:type, secondo l'approccio usato in [GeoDCAT-AP], e adottato in [DCAT-AP-IT] e [GeoDCAT-AP-IT]). @it
scope note: Scenari tipici per l'uso di serie di dataset: serie temporali costituite di dataset pubblicati regolarmente; serie di mappe costituite da elementi dello stesso tipo o tematica ma relative a differenti aree geografiche. @it
scope note: También puede asignarse un tipo a las series de datos usando la propiedad dcterms:type como se hace en [GeoDCAT-AP], y adoptado en [DCAT-AP-IT] y [GeoDCAT-AP-IT]). @es

Distribuce
type: Class
comment: A specific representation of a dataset. A dataset might be available in multiple serializations that may differ in various ways, including natural language, media-type or format, schematic organization, temporal and spatial resolution, level of detail or profiles (which might specify any or all of the above).
comment: En specifik repræsentation af et datasæt. Et datasæt kan være tilgængelig i mange serialiseringer der kan variere på forskellige vis, herunder sprog, medietype eller format, systemorganisering, tidslig- og geografisk opløsning, detaljeringsniveau eller profiler (der kan specificere en eller flere af ovenstående). @da
comment: Konkrétní reprezentace datové sady. Datová sada může být dostupná v různých serializacích, které se mohou navzájem lišit různými způsoby, mimo jiné přirozeným jazykem, media-typem či formátem, schematickou organizací, časovým a prostorovým rozlišením, úrovní detailu či profily (které mohou specifikovat některé či všechny tyto rozdíly). @cs
comment: Rappresenta una forma disponibile e specifica del dataset. Ciascun dataset può essere disponibile in forme differenti, che possono rappresentare formati diversi o diversi punti di accesso per un dataset. Esempi di distribuzioni sono un file CSV scaricabile, una API o un RSS feed. @it
comment: Représente une forme spécifique d'un jeu de données. Caque jeu de données peut être disponible sous différentes formes, celles-ci pouvant représenter différents formats du jeu de données ou différents endpoint. Des exemples de distribution sont des fichirs CSV, des API ou des flux RSS. @fr
comment: Una representación específica de los datos. Cada conjunto de datos puede estar disponible en formas diferentes, las cuáles pueden variar en distintas formas, incluyendo el idioma, 'media-type' o formato, organización esquemática, resolución temporal y espacial, nivel de detalle o perfiles (que pueden especificar cualquiera o todas las diferencias anteriores). @es
comment: Αναπαριστά μία συγκεκριμένη διαθέσιμη μορφή ενός συνόλου δεδομένων. Κάθε σύνολο δεδομενων μπορεί να είναι διαθέσιμο σε διαφορετικές μορφές, οι μορφές αυτές μπορεί να αναπαριστούν διαφορετικές μορφές αρχείων ή διαφορετικά σημεία διάθεσης. Παραδείγματα διανομών συμπεριλαμβάνουν ένα μεταφορτώσιμο αρχείο μορφής CSV, ένα API ή ένα RSS feed. @el
comment: شكل محدد لقائمة البيانات يمكن الوصول إليه. قائمة بيانات ما يمكن أن تكون متاحه باشكال و أنواع متعددة. ملف يمكن تحميله أو واجهة برمجية يمكن من خلالها الوصول إلى البيانات هي أمثلة على ذلك. @ar
comment: データセットの特定の利用可能な形式を表わします。各データセットは、異なる形式で利用できることがあり、これらの形式は、データセットの異なる形式や、異なるエンドポイントを表わす可能性があります。配信の例には、ダウンロード可能なCSVファイル、API、RSSフィードが含まれます。 @ja
label: Distribución @es
label: Distribution
label: Distribuzione @it
label: Διανομή @el
label: التوزيع @ar
label: 配信 @ja
alternative label: Datadistribution @da
alternative label: Datamanifestation @da
alternative label: Datarepræsentation @da
alternative label: Dataudstilling @da
scope note: Ceci représente une disponibilité générale du jeu de données, et implique qu'il n'existe pas d'information sur la méthode d'accès réelle des données, par exple, si c'est un lien de téléchargement direct ou à travers une page Web. @fr
scope note: Denne klasse repræsenterer datasættets overordnede tilgængelighed og giver ikke oplysninger om hvilken metode der kan anvendes til at få adgang til data, dvs. om adgang til datasættet realiseres ved direkte download, API eller via et websted. Anvendelsen af egenskaben dcat:downloadURL indikerer at distributionen kan downloades direkte. @da
scope note: Esta clase representa una disponibilidad general de un conjunto de datos, e implica que no existe información acerca del método de acceso real a los datos, i.e., si es un enlace de descarga directa o a través de una página Web. @es
scope note: Questa classe rappresenta una disponibilità generale di un dataset e non implica alcuna informazione sul metodo di accesso effettivo ai dati, ad esempio se si tratta di un accesso a download diretto, API, o attraverso una pagina Web. L'utilizzo della proprietà dcat:downloadURL indica distribuzioni direttamente scaricabili. @it
scope note: This represents a general availability of a dataset it implies no information about the actual access method of the data, i.e. whether by direct download, API, or through a Web page. The use of dcat:downloadURL property indicates directly downloadable distributions.
scope note: Toto popisuje obecnou dostupnost datové sady. Neimplikuje žádnou informaci o skutečné metodě přístupu k datům, tj. zda jsou přímo ke stažení, skrze API či přes webovou stránku. Použití vlastnosti dcat:downloadURL indikuje přímo stažitelné distribuce. @cs
scope note: Αυτό αναπαριστά μία γενική διαθεσιμότητα ενός συνόλου δεδομένων και δεν υπονοεί τίποτα περί του πραγματικού τρόπου πρόσβασης στα δεδομένα, αν είναι άμεσα μεταφορτώσιμα, μέσω API ή μέσω μίας ιστοσελίδας. Η χρήση της ιδιότητας dcat:downloadURL δείχνει μόνο άμεσα μεταφορτώσιμες διανομές. @el
scope note: これは、データセットの一般的な利用可能性を表わし、データの実際のアクセス方式に関する情報（つまり、直接ダウンロードなのか、APIなのか、ウェブページを介したものなのか）を意味しません。dcat:downloadURLプロパティーの使用は、直接ダウンロード可能な配信を意味します。 @ja

Relationship
type: Class
comment: An association class for attaching additional information to a relationship between DCAT Resources.
comment: Asociační třída pro připojení dodatečných informací ke vztahu mezi zdroji DCAT. @cs
comment: En associationsklasse til brug for tilknytning af yderligere information til en relation mellem DCAT-ressourcer. @da
comment: Una clase de asociación para adjuntar información adicional a una relación entre recursos DCAT. @es
comment: Una classe di associazione per il collegamento di informazioni aggiuntive a una relazione tra le risorse DCAT. @it
label: Relación @es
label: Relation @da
label: Relazione @it
label: Vztah @cs
change note: New class added in DCAT 2
change note: Nová třída přidaná ve verzi DCAT 2 @cs
change note: Nueva clase añadida en DCAT 2 @es
change note: Nuova classe aggiunta in DCAT 2 @it
change note: Ny klasse i DCAT 2 @da
scope note: Anvendes til at karakterisere en relation mellem datasæt, og potentielt andre ressourcer, hvor relationen er kendt men ikke tilstrækkeligt beskrevet af de standardiserede egenskaber i Dublin Core (dcterms:hasPart, dcterms:isPartOf, dcterms:conformsTo, dcterms:isFormatOf, dcterms:hasFormat, dcterms:isVersionOf, dcterms:hasVersion, dcterms:replaces, dcterms:isReplacedBy, dcterms:references, dcterms:isReferencedBy, dcterms:requires, dcterms:isRequiredBy) eller PROV-O-egenskaber (prov:wasDerivedFrom, prov:wasInfluencedBy, prov:wasQuotedFrom, prov:wasRevisionOf, prov:hadPrimarySource, prov:alternateOf, prov:specializationOf). @da
scope note: Používá se pro charakterizaci vztahu mezi datovými sadami a případně i jinými zdroji, kde druh vztahu je sice znám, ale není přiměřeně charakterizován standardními vlastnostmi slovníku Dublin Core (dcterms:hasPart, dcterms:isPartOf, dcterms:conformsTo, dcterms:isFormatOf, dcterms:hasFormat, dcterms:isVersionOf, dcterms:hasVersion, dcterms:replaces, dcterms:isReplacedBy, dcterms:references, dcterms:isReferencedBy, dcterms:requires, dcterms:isRequiredBy) či vlastnostmi slovníku PROV-O (prov:wasDerivedFrom, prov:wasInfluencedBy, prov:wasQuotedFrom, prov:wasRevisionOf, prov:hadPrimarySource, prov:alternateOf, prov:specializationOf). @cs
scope note: Se usa para caracterizar la relación entre conjuntos de datos, y potencialmente otros recursos, donde la naturaleza de la relación se conoce pero no está caracterizada adecuadamente con propiedades del estándar 'Dublin Core' (dcterms:hasPart, dcterms:isPartOf, dcterms:conformsTo, dcterms:isFormatOf, dcterms:hasFormat, dcterms:isVersionOf, dcterms:hasVersion, dcterms:replaces, dcterms:isReplacedBy, dcterms:references, dcterms:isReferencedBy, dcterms:requires, dcterms:isRequiredBy) or PROV-O properties (prov:wasDerivedFrom, prov:wasInfluencedBy, prov:wasQuotedFrom, prov:wasRevisionOf, prov:hadPrimarySource, prov:alternateOf, prov:specializationOf). @es
scope note: Use to characterize a relationship between datasets, and potentially other resources, where the nature of the relationship is known but is not adequately characterized by the standard Dublin Core properties (dcterms:hasPart, dcterms:isPartOf, dcterms:conformsTo, dcterms:isFormatOf, dcterms:hasFormat, dcterms:isVersionOf, dcterms:hasVersion, dcterms:replaces, dcterms:isReplacedBy, dcterms:references, dcterms:isReferencedBy, dcterms:requires, dcterms:isRequiredBy) or PROV-O properties (prov:wasDerivedFrom, prov:wasInfluencedBy, prov:wasQuotedFrom, prov:wasRevisionOf, prov:hadPrimarySource, prov:alternateOf, prov:specializationOf).
scope note: Viene utilizzato per caratterizzare la relazione tra insiemi di dati, e potenzialmente altri tipi di risorse, nei casi in cui la natura della relazione è nota ma non adeguatamente caratterizzata dalle proprietà dello standard 'Dublin Core' (dcterms:hasPart, dcterms:isPartOf, dcterms:conformsTo, dcterms:isFormatOf, dcterms:hasFormat, dcterms:isVersionOf, dcterms:hasVersion, dcterms:replaces, dcterms:isReplacedBy, dcterms:references, dcterms:isReferencedBy, dcterms:require, dcterms:isRequiredBy) o dalle propietà fornite da PROV-O (prov:wasDerivedFrom, prov:wasInfluencedBy, prov:wasQuotedFrom, prov:wasRevisionOf, prov: hadPrimarySource, prov:alternateOf, prov:specializationOf). @it

Catalogued resource
type: Class
comment: Recurso publicado o curado por un agente único. @es
comment: Resource published or curated by a single agent.
comment: Ressource udgivet eller udvalgt og arrangeret af en enkelt aktør. @da
comment: Risorsa pubblicata o curata da un singolo agente. @it
comment: Zdroj publikovaný či řízený jediným činitelem. @cs
label: Katalogiseret ressource @da
label: Katalogizovaný zdroj @cs
label: Recurso catalogado @es
label: Risorsa catalogata @it
change note: New class added in DCAT 2
change note: Nová třída přidaná ve verzi DCAT 2 @cs
change note: Nueva clase agregada en DCAT 2 @es
change note: Nuova classe aggiunta in DCAT 2 @it
change note: Ny klasse i DCAT 2 @da
editorial note: 2020-08-23 Scopenote updated and needs to be translated
scope note: Klassen for alle katalogiserede ressourcer, den overordnede klasse for dcat:Dataset, dcat:DataService, dcat:Catalog og enhvert medlem af et dcat:Catalog. Denne klasse bærer egenskaber der gælder alle katalogiserede ressourcer, herunder dataset og datatjenester. Det anbefales kraftigt at mere specifikke subklasser oprettes. Når der beskrives ressourcer der ikke er dcat:Dataset eller dcat:DataService, anbefales det at oprette passende subklasser af dcat:Resource eller at dcat:Resource anvendes sammen med egenskaben dcterms:type til opmærkning med en specifik typeangivelse. @da
scope note: La clase de todos los recursos catalogados, la superclase de dcat:Dataset, dcat:DataService, dcat:Catalog y cualquier otro miembro de un dcat:Catalog. Esta clase tiene propiedades comunes a todos los recursos catalogados, incluyendo conjuntos de datos y servicios de datos. Se recomienda fuertemente que se use una clase más específica. Cuando se describe un recurso que no es un dcat:Dataset o dcat:DataService, se recomienda crear una sub-clase apropiada de dcat:Resource, o usar dcat:Resource con la propiedad dcterms:type to indicar el tipo específico. @es
scope note: La classe di tutte le risorse catalogate, la Superclasse di dcat:Dataset, dcat:DataService, dcat:Catalog e qualsiasi altro membro di dcat:Catalog. Questa classe porta proprietà comuni a tutte le risorse catalogate, inclusi set di dati e servizi dati. Si raccomanda vivamente di utilizzare una sottoclasse più specifica. Quando si descrive una risorsa che non è un dcat:Dataset o dcat:DataService, si raccomanda di creare una sottoclasse di dcat:Resource appropriata, o utilizzare dcat:Resource con la proprietà dcterms:type per indicare il tipo specifico. @it
scope note: The class of all catalogued resources, the Superclass of dcat:Dataset, dcat:DataService, dcat:Catalog and any other member of a dcat:Catalog. This class carries properties common to all catalogued resources, including datasets and data services. The instances of this class SHOULD be included in a catalog. The instances of this class SHOULD be included in a catalog. It is strongly recommended to use a more specific sub-class. When describing a resource which is not a dcat:Dataset or dcat:DataService, it is recommended to create a suitable sub-class of dcat:Resource, or use dcat:Resource with the dcterms:type property to indicate the specific type.
scope note: Třída všech katalogizovaných zdrojů, nadtřída dcat:Dataset, dcat:DataService, dcat:Catalog a všech ostatních členů dcat:Catalog. Tato třída nese vlastnosti společné všem katalogizovaným zdrojům včetně datových sad a datových služeb. Je silně doporučeno používat specifičtější podtřídy, pokud je to možné. Při popisu zdroje, který není ani dcat:Dataset, ani dcat:DataService se doporučuje vytvořit odpovídající podtřídu dcat:Resrouce a nebo použít dcat:Resource s vlastností dcterms:type pro určení konkrétního typu. @cs
scope note: dcat:Resource er et udvidelsespunkt der tillader oprettelsen af enhver type af kataloger. Yderligere subklasser kan defineres i en DCAT-profil eller i en applikation til kataloger med andre typer af ressourcer. @da
scope note: dcat:Resource es un punto de extensión que permite la definición de cualquier tipo de catálogo. Se pueden definir subclases adicionales en perfil de DCAT o una aplicación para catálogos de otro tipo de recursos. @es
scope note: dcat:Resource is an extension point that enables the definition of any kind of catalog. Additional subclasses may be defined in a DCAT profile or application for catalogs of other kinds of resources.
scope note: dcat:Resource je bod pro rozšíření umožňující definici různých druhů katalogů. Další podtřídy lze definovat v profilech DCAT či aplikacích pro katalogy zdrojů jiných druhů. @cs
scope note: dcat:Resource è un punto di estensione che consente la definizione di qualsiasi tipo di catalogo. Sottoclassi aggiuntive possono essere definite in un profilo DCAT o in un'applicazione per cataloghi di altri tipi di risorse. @it

Rol
type: Class
comment: A role is the function of a resource or agent with respect to another resource, in the context of resource attribution or resource relationships.
comment: En rolle er den funktion en ressource eller aktør har i forhold til en anden ressource, i forbindelse med ressourcekreditering eller ressourcerelationer. @da
comment: Role je funkce zdroje či agenta ve vztahu k jinému zdroji, v kontextu přiřazení zdrojů či vztahů mezi zdroji. @cs
comment: Un rol es la función de un recurso o agente con respecto a otro recuros, en el contexto de atribución del recurso o de las relaciones entre recursos. @es
comment: Un ruolo è la funzione di una risorsa o di un agente rispetto ad un'altra risorsa, nel contesto dell'attribuzione delle risorse o delle relazioni tra risorse. @it
label: Role
label: Rolle @da
label: Ruolo @it
subclass of: Concept
change note: New class added in DCAT 2
change note: Nová třída přidaná ve verzi DCAT 2 @cs
change note: Nueva clase agregada en DCAT 2 @es
change note: Nuova classe aggiunta in DCAT 2 @it
change note: Ny klasse tilføjet i DCAT 2 @da
editorial note: Incluída en DCAT para complementar prov:Role (cuyo uso está limitado a roles en el contexto de una actividad, ya que es el rango es prov:hadRole). @es
editorial note: Introdotta in DCAT per completare prov:Role (il cui uso è limitato ai ruoli nel contesto di un'attività, in conseguenza alla definizione del codominio di prov:hadRole). @it
editorial note: Introduced into DCAT to complement prov:Role (whose use is limited to roles in the context of an activity, as the range of prov:hadRole).
editorial note: Introduceret i DCAT for at supplere prov:Role (hvis anvendelse er begrænset til roller i forbindelse med en aktivitet, som er rækkevidde for prov:hadRole). @da
editorial note: Přidáno do DCAT pro doplnění třídy prov:Role (jejíž užití je omezeno na role v kontextu aktivit, jakožto obor hodnot vlastnosti prov:hadRole). @cs
scope note: Anvendes i forbindelse med kvalificerede krediteringer til at angive aktørens rolle i forhold til en entitet. Det anbefales at værdierne styres som et kontrolleret udfaldsrum med aktørroller, såsom http://registry.it.csiro.au/def/isotc211/CI_RoleCode. @da
scope note: Anvendes i forbindelse med kvalificerede relationer til at specificere en entitets rolle i forhold til en anden entitet. Det anbefales at værdierne styres med et kontrolleret udfaldsrum for for entitetsroller såsom: ISO 19115 DS_AssociationTypeCode http://registry.it.csiro.au/def/isotc211/DS_AssociationTypeCode; IANA Registry of Link Relations https://www.iana.org/assignments/link-relation; DataCite metadata schema; MARC relators https://id.loc.gov/vocabulary/relators. @da
scope note: Použito v kvalifikovaném přiřazení pro specifikaci role Agenta ve vztahu k Entitě. Je doporučeno množinu hodnot spravovat jako řízený slovník rolí agentů, jako například http://registry.it.csiro.au/def/isotc211/CI_RoleCode. @cs
scope note: Použito v kvalifikovaném vztahu pro specifikaci role Entity ve vztahu k jiné Entitě. Je doporučeno množinu hodnot spravovat jako řízený slovník rolí entit, jako například ISO 19115 DS_AssociationTypeCode http://registry.it.csiro.au/def/isotc211/DS_AssociationTypeCode, IANA Registry of Link Relations https://www.iana.org/assignments/link-relation, DataCite metadata schema, či MARC relators https://id.loc.gov/vocabulary/relators. @cs
scope note: Se usa en una atribución cualificada para especificar el rol de un Agente con respecto a una Entidad. Se recomienda que los valores se administren como un vocabulario controlado de roles de agente, como por ejemplo http://registry.it.csiro.au/def/isotc211/CI_RoleCode. @es
scope note: Se usa en una relación cualificada para especificar el rol de una Entidad con respecto a otra Entidad. Se recomienda que los valores se administren como los valores de un vocabulario controlado de roles de entidad como por ejemplo: ISO 19115 DS_AssociationTypeCode http://registry.it.csiro.au/def/isotc211/DS_AssociationTypeCode; IANA Registry of Link Relations https://www.iana.org/assignments/link-relation; el esquema de metadatos de DataCite; MARC relators https://id.loc.gov/vocabulary/relators. @es
scope note: Used in a qualified-attribution to specify the role of an Agent with respect to an Entity. It is recommended that the values be managed as a controlled vocabulary of agent roles, such as http://registry.it.csiro.au/def/isotc211/CI_RoleCode.
scope note: Used in a qualified-relation to specify the role of an Entity with respect to another Entity. It is recommended that the values be managed as a controlled vocabulary of entity roles such as: ISO 19115 DS_AssociationTypeCode http://registry.it.csiro.au/def/isotc211/DS_AssociationTypeCode; IANA Registry of Link Relations https://www.iana.org/assignments/link-relation; DataCite metadata schema; MARC relators https://id.loc.gov/vocabulary/relators.
scope note: Utilizzato in un'attribuzione qualificata per specificare il ruolo di un agente rispetto a un'entità. Si consiglia di attribuire i valori considerando un vocabolario controllato dei ruoli dell'agente, ad esempio http://registry.it.csiro.au/def/isotc211/CI_RoleCode. @it
scope note: Utilizzato in una relazione qualificata per specificare il ruolo di un'entità rispetto a un'altra entità. Si raccomanda che il valore sia preso da un vocabolario controllato di ruoli di entità come ISO 19115 DS_AssociationTypeCode http://registry.it.csiro.au/def/isotc211/DS_AssociationTypeCode, IANA Registry of Link Relations https://www.iana.org/assignments/link-relation, DataCite metadata schema, o MARC relators https://id.loc.gov/vocabulary/relators. @it

data access service
type: ObjectProperty
comment: A site or end-point that gives access to the distribution of the dataset.
comment: Et websted eller endpoint der giver adgang til en repræsentation af datasættet. @da
comment: Umístění či přístupový bod zpřístupňující distribuci datové sady. @cs
comment: Un sitio o end-point que da acceso a la distribución de un conjunto de datos. @es
comment: Un sito o end-point che dà accesso alla distribuzione del set di dati. @it
label: dataadgangstjeneste @da
label: servicio de acceso de datos @es
label: servizio di accesso ai dati @it
label: služba pro přístup k datům @cs
range: Data service
change note: New property added in DCAT 2.
change note: Nová vlastnost přidaná ve verzi DCAT 2. @cs
change note: Nueva propiedad agregada en DCAT 2. @es
change note: Nuova proprietà aggiunta in DCAT 2. @it
change note: Ny egenskab tilføjet i DCAT 2. @da

access address
type: ObjectProperty
comment: A URL of a resource that gives access to a distribution of the dataset. E.g. landing page, feed, SPARQL endpoint. Use for all cases except a simple download link, in which case downloadURL is preferred.
comment: Ceci peut être tout type d'URL qui donne accès à une distribution du jeu de données. Par exemple, un lien à une page HTML contenant un lien au jeu de données, un Flux RSS, un point d'accès SPARQL. Utilisez le lorsque votre catalogue ne contient pas d'information sur quoi il est ou quand ce n'est pas téléchargeable. @fr
comment: En URL for en ressource som giver adgang til en repræsentation af datsættet. Fx destinationsside, feed, SPARQL-endpoint. Anvendes i alle sammenhænge undtagen til angivelse af et simpelt download link hvor anvendelse af egenskaben downloadURL foretrækkes. @da
comment: Puede ser cualquier tipo de URL que de acceso a una distribución del conjunto de datos, e.g., página de destino, descarga, URL feed, punto de acceso SPARQL. Esta propriedad se debe usar cuando su catálogo de datos no tiene información sobre donde está o cuando no se puede descargar. @es
comment: URL zdroje, přes které je přístupná distribuce datové sady. Příkladem může být vstupní stránka, RSS kanál či SPARQL endpoint. Použijte ve všech případech kromě URL souboru ke stažení, pro které je lepší použít dcat:downloadURL. @cs
comment: Un URL di una risorsa che consente di accedere a una distribuzione del set di dati. Per esempio, pagina di destinazione, feed, endpoint SPARQL. Da utilizzare per tutti i casi, tranne quando si tratta di un semplice link per il download nel qual caso è preferito downloadURL. @it
comment: Μπορεί να είναι οποιουδήποτε είδους URL που δίνει πρόσβαση στη διανομή ενός συνόλου δεδομένων. Π.χ. ιστοσελίδα αρχικής πρόσβασης, μεταφόρτωση, feed URL, σημείο διάθεσης SPARQL. Να χρησιμοποιείται όταν ο κατάλογος δεν περιέχει πληροφορίες εαν πρόκειται ή όχι για μεταφορτώσιμο αρχείο. @el
comment: أي رابط يتيح الوصول إلى البيانات. إذا كان الرابط هو ربط مباشر لملف يمكن تحميله استخدم الخاصية downloadURL @ar
comment: データセットの配信にアクセス権を与えるランディング・ページ、フィード、SPARQLエンドポイント、その他の種類の資源。 @ja
domain: Distribuce
label: URL d'accès @fr
label: URL de acceso @es
label: URL πρόσβασης @el
label: adgangsadresse @da
label: indirizzo di accesso @it
label: přístupová adresa @cs
label: رابط وصول @ar
label: アクセスURL @ja
range: Resource
property chain axiom: data access service
property chain axiom: service end-point
alternative label: adgangsURL @da
editorial note: Status: English Definition text modified by DCAT revision team, updated Italian and Czech translation provided, translations for other languages pending.
editorial note: rdfs:label, rdfs:comment and skos:scopeNote have been modified. Non-english versions except for Italian must be updated.
scope note: El rango es una URL. Si la distribución es accesible solamente través de una página de destino (es decir, si no se conoce una URL de descarga directa), entonces el enlance a la página de destino debe ser duplicado como accessURL en la distribución. @es
scope note: Hvis en eller flere distributioner kun er tilgængelige via en destinationsside (dvs. en URL til direkte download er ikke kendt), så bør destinationssidelinket gentages som adgangsadresse for distributionen. @da
scope note: If the distribution(s) are accessible only through a landing page (i.e. direct download URLs are not known), then the landing page link should be duplicated as accessURL on a distribution.
scope note: La valeur est une URL. Si la distribution est accessible seulement au travers d'une page d'atterrissage (c-à-dire on n'ignore une URL de téléchargement direct), alors le lien à la page d'atterrissage doit être dupliqué comee accessURL sur la distribution. @fr
scope note: Pokud jsou distribuce přístupné pouze přes vstupní stránku (tj. URL pro přímé stažení nejsou známa), pak by URL přístupové stránky mělo být duplikováno ve vlastnosti distribuce accessURL. @cs
scope note: Se le distribuzioni sono accessibili solo attraverso una pagina web (ad esempio, gli URL per il download diretto non sono noti), allora il link della pagina web deve essere duplicato come accessURL sulla distribuzione. @it
scope note: Η τιμή είναι ένα URL. Αν η/οι διανομή/ές είναι προσβάσιμη/ες μόνο μέσω μίας ιστοσελίδας αρχικής πρόσβασης (δηλαδή αν δεν υπάρχουν γνωστές διευθύνσεις άμεσης μεταφόρτωσης), τότε ο σύνδεσμος της ιστοσελίδας αρχικής πρόσβασης πρέπει να αναπαραχθεί ως accessURL σε μία διανομή. @el
scope note: 確実にダウンロードでない場合や、ダウンロードかどうかが不明である場合は、downloadURLではなく、accessURLを用いてください。ランディング・ページを通じてしか配信にアクセスできない場合（つまり、直接的なダウンロードURLが不明）は、配信におけるaccessURLとしてランディング・ページのリンクをコピーすべきです（SHOULD）。 @ja

bounding box
type: DatatypeProperty
comment: Den geografiske omskrevne firkant af en ressource. @da
comment: El cuadro delimitador geográfico para un recurso. @es
comment: Il riquadro di delimitazione geografica di una risorsa. @it
comment: Ohraničení geografické oblasti zdroje. @cs
comment: The geographic bounding box of a spatial thing [SDW-BP].
domain: Location
label: cuadro delimitador @es
label: ohraničení oblasti @cs
label: quadro di delimitazione @it
range: Literal
change note: New property added in DCAT 2.
change note: Nová vlastnost přidaná ve verzi DCAT 2. @cs
change note: Nuova proprietà aggiunta in DCAT 2. @it
change note: Ny egenskab tilføjet i DCAT 2. @da
change note: Propiedad nueva agregada en DCAT 2. @es
editorial note: English language definitions and comments updated in this revision in line with ED. Multilingual text unevenly updated.
scope note: El rango de esta propiedad es intencionalmente genérico con el propósito de permitir distintas codificaciones geométricas. Por ejemplo, la geometría puede ser codificada como WKT (geosparql:wktLiteral [GeoSPARQL]) o [GML] (geosparql:asGML [GeoSPARQL]). @es
scope note: Il range di questa proprietà (rdfs:Literal) è volutamente generica, con lo scopo di consentire diverse codifiche geometriche letterali. Ad esempio, la geometria potrebbe essere codificata con un letterale WKT (geosparql:wktLiteral [GeoSPARQL]) o [GML] (geosparql:asGML [GeoSPARQL]). @it
scope note: Obor hodnot této vlastnosti je úmyslně obecný, aby umožnil různé kódování geometrií. Geometrie by kupříkladu mohla být kódována jako WKT (geosparql:wktLiteral [GeoSPARQL]) či [GML] (geosparql:asGML [GeoSPARQL]). @cs
scope note: Rækkevidden for denne egenskab er bevidst generisk defineret med det formål at tillade forskellige kodninger af geometrier. Geometrien kan eksempelvis repræsenteres som WKT (geosparql:asWKT [GeoSPARQL]) eller [GML] (geosparql:asGML [GeoSPARQL]). @da
scope note: The range of this property (rdfs:Literal) is intentionally generic, with the purpose of allowing different geometry literal encodings. E.g., the geometry could be encoded as a WKT literal (geosparql:wktLiteral [GeoSPARQL]).

byte size
type: DatatypeProperty
comment: El tamaño de una distribución en bytes. @es
comment: La dimensione di una distribuzione in byte. @it
comment: La taille de la distribution en octects @fr
comment: Størrelsen af en distributionen angivet i bytes. @da
comment: The size of a distribution in bytes.
comment: Velikost distribuce v bajtech. @cs
comment: Το μέγεθος μιας διανομής σε bytes. @el
comment: الحجم بالبايتات @ar
comment: バイトによる配信のサイズ。 @ja
domain: Distribuce
label: bytestørrelse @da
label: dimensione in byte @it
label: taille en octects @fr
label: tamaño en bytes @es
label: velikost v bajtech @cs
label: μέγεθος σε bytes @el
label: الحجم بالبايت @ar
label: バイト・サイズ @ja
range: Literal
definition: La taille de la distribution en octects. @fr
definition: Størrelsen af en distribution angivet i bytes. @da
scope note: Bytestørrelsen kan approximeres hvis den præcise størrelse ikke er kendt. Værdien af dcat:byteSize bør angives som xsd:decimal. @da
scope note: El tamaño en bytes puede ser aproximado cuando se desconoce el tamaño exacto. El valor literal de dcat:byteSize debe tener tipo 'xsd:decimal'. @es
scope note: La dimensione in byte può essere approssimata quando non si conosce la dimensione precisa. Il valore di dcat:byteSize dovrebbe essere espresso come un xsd:decimal. @it
scope note: La taille en octects peut être approximative lorsque l'on ignore la taille réelle. La valeur littérale de dcat:byteSize doit être de type xsd:decimal. @fr
scope note: The size in bytes can be approximated when the precise size is not known. The literal value of dcat:byteSize should by typed as xsd:decimal.
scope note: Velikost v bajtech může být přibližná, pokud její přesná hodnota není známa. Literál s hodnotou dcat:byteSize by měl mít datový typ xsd:decimal. @cs
scope note: Το μέγεθος σε bytes μπορεί να προσεγγιστεί όταν η ακριβής τιμή δεν είναι γνωστή. Η τιμή της dcat:byteSize θα πρέπει να δίνεται με τύπο δεδομένων xsd:decimal. @el
scope note: الحجم يمكن أن يكون تقريبي إذا كان الحجم الدقيق غير معروف @ar
scope note: 正確なサイズが不明である場合、サイズは、バイトによる近似値を示すことができます。 @ja

catalog
type: ObjectProperty
comment: A catalog that is listed in the catalog.
comment: Et katalog hvis indhold er relevant i forhold til det aktuelle katalog. @da
comment: Katalog, jehož obsah je v kontextu tohoto katalogu zajímavý. @cs
comment: Un catalogo i cui contenuti sono di interesse nel contesto di questo catalogo. @it
comment: Un catálogo cuyo contenido es de interés en el contexto del catálogo que está siendo descripto. @es
domain: Catalog
label: catalogo @it
label: catálogo @es
label: katalog @cs
range: Catalog
sub property of: resource
alternative label: har delkatalog @da
alternative label: has catalog
change note: New property added in DCAT 2.
change note: Nová vlastnost přidaná ve verzi DCAT 2. @cs
change note: Nueva propiedad agregada en DCAT 2. @es
change note: Nuova proprietà aggiunta in DCAT 2. @it
editorial note: Status: English Definition text modified by DCAT 3 revision team, translations pending.

centroid
type: DatatypeProperty
comment: Det geometrisk tyngdepunkt (centroid) for en ressource. @da
comment: El centro geográfico (centroide) de un recurso. @es
comment: Geografický střed (centroid) zdroje. @cs
comment: Il centro geografico (centroide) di una risorsa. @it
comment: The geographic center (centroid) of a spatial thing [SDW-BP].
domain: Location
label: centroide @es
label: geometrisk tyngdepunkt @da
range: Literal
change note: New property added in DCAT 2.
change note: Nová vlastnost přidaná ve verzi DCAT 2. @cs
change note: Nueva propiedad agregada en DCAT 2. @es
change note: Nuova proprietà aggiunta in DCAT 2. @it
change note: Ny egenskab tilføjet i DCAT 2. @da
editorial note: English language definitions and comments updated in this revision in line with ED. Multilingual text unevenly updated.
scope note: El rango de esta propiedad es intencionalmente genérico con el objetivo de permitir distintas codificaciones geométricas. Por ejemplo, la geometría puede codificarse como WKT (geosparql:wktLiteral [GeoSPARQL]) o [GML] (geosparql:asGML [GeoSPARQL]). @es
scope note: Il range di questa proprietà (rdfs:Literal) è volutamente generica, con lo scopo di consentire diverse codifiche geometriche letterali. Ad esempio, la geometria potrebbe essere codificata con un letterale WKT (geosparql:wktLiteral [GeoSPARQL]) o [GML] (geosparql:asGML [GeoSPARQL]). @it
scope note: Obor hodnot této vlastnosti je úmyslně obecný, aby umožnil různé kódování geometrií. Geometrie by kupříkladu mohla být kódována jako WKT (geosparql:wktLiteral [GeoSPARQL]) či [GML] (geosparql:asGML [GeoSPARQL]). @cs
scope note: Rækkevidden for denne egenskab er bevidst generisk definere med det formål at tillade forskellige geokodninger. Geometrien kan eksempelvis repræsenteres som WKT (geosparql:asWKT [GeoSPARQL]) eller [GML] (geosparql:asGML [GeoSPARQL]). @da
scope note: The range of this property (rdfs:Literal) is intentionally generic, with the purpose of allowing different geometry literal encodings. E.g., the geometry could be encoded as a WKT literal (geosparql:wktLiteral [GeoSPARQL]).

compression format
type: ObjectProperty
comment: El formato de la distribución en el que los datos están en forma comprimida, e.g. para reducir el tamaño del archivo a bajar. @es
comment: Formát komprese souboru, ve kterém jsou data poskytována v komprimované podobě, např. ke snížení velikosti souboru ke stažení. @cs
comment: Il formato di compressione della distribuzione nel quale i dati sono in forma compressa, ad es. per ridurre le dimensioni del file da scaricare. @it
comment: Kompressionsformatet for distributionen som indeholder data i et komprimeret format, fx for at reducere størrelsen af downloadfilen. @da
comment: The compression format of the distribution in which the data is contained in a compressed form, e.g. to reduce the size of the downloadable file.
domain: Distribuce
label: formato de compresión @es
label: formato di compressione @it
label: formát komprese @cs
label: kompressionsformat @da
range: MediaType
sub property of: format
change note: New property added in DCAT 2.
change note: Nová vlastnost přidaná ve verzi DCAT 2. @cs
change note: Nueva propiedad agregada en DCAT 2. @es
change note: Nuova proprietà aggiunta in DCAT 2. @it
change note: Ny egenskab tilføjet i DCAT 2. @da
scope note: Denne egenskab kan anvendes når filerne i en distribution er blevet komprimeret, fx i en ZIP-fil. Formatet BØR udtrykkes ved en medietype som defineret i 'IANA media types registry', hvis der optræder en relevant medietype dér: https://www.iana.org/assignments/media-types/. @da
scope note: Esta propiedad se debe usar cuando los archivos de la distribución están comprimidos, por ejemplo en un archivo ZIP. El formato DEBERÍA expresarse usando un 'media type', tales como los definidos en el registro IANA de 'media types' https://www.iana.org/assignments/media-types/, si está disponibles. @es
scope note: Questa proprietà deve essere utilizzata quando i file nella distribuzione sono compressi, ad es. in un file ZIP. Il formato DOVREBBE essere espresso usando un tipo di media come definito dal registro dei tipi di media IANA https://www.iana.org/assignments/media-types/, se disponibile. @it
scope note: Tato vlastnost se použije, když jsou soubory v distribuci komprimovány, např. v ZIP souboru. Formát BY MĚL být vyjádřen pomocí typu média definovaného v registru IANA https://www.iana.org/assignments/media-types/, pokud existuje. @cs
scope note: This property is to be used when the files in the distribution are compressed, e.g. in a ZIP file. The format SHOULD be expressed using a media type as defined by IANA media types registry https://www.iana.org/assignments/media-types/, if available.

contact point
type: ObjectProperty
comment: Información relevante de contacto para el recurso catalogado. Se recomienda el uso de vCard. @es
comment: Informazioni di contatto rilevanti per la risorsa catalogata. Si raccomanda l'uso di vCard. @it
comment: Relevant contact information for the catalogued resource. Use of vCard is recommended.
comment: Relevante kontaktoplysninger for den katalogiserede ressource. Anvendelse af vCard anbefales. @da
comment: Relevantní kontaktní informace pro katalogizovaný zdroj. Doporučuje se použít slovník VCard. @cs
comment: Relie un jeu de données à une information de contact utile en utilisant VCard. @fr
comment: Συνδέει ένα σύνολο δεδομένων με ένα σχετικό σημείο επικοινωνίας, μέσω VCard. @el
comment: تربط قائمة البيانات بعنوان اتصال موصف باستخدام VCard @ar
comment: データセットを、VCardを用いて提供されている適切な連絡先情報にリンクします。 @ja
label: Punto de contacto @es
label: kontaktní bod @cs
label: kontaktpunkt @da
label: point de contact @fr
label: punto di contatto @it
label: σημείο επικοινωνίας @el
label: عنوان اتصال @ar
label: 窓口 @ja
range: Kind
editorial note: Status: English Definition text modified by DCAT revision team, Italian, Spanish and Czech translations provided, other translations pending.

dataset
type: ObjectProperty
comment: A dataset that is listed in the catalog.
comment: En samling af data som er opført i kataloget. @da
comment: Kolekce dat, která je katalogizována v katalogu. @cs
comment: Relie un catalogue à un jeu de données faisant partie de ce catalogue. @fr
comment: Un conjunto de datos que se lista en el catálogo. @es
comment: Una raccolta di dati che è elencata nel catalogo. @it
comment: Συνδέει έναν κατάλογο με ένα σύνολο δεδομένων το οποίο ανήκει στον εν λόγω κατάλογο. @el
comment: تربط الفهرس بقائمة بيانات ضمنه @ar
comment: カタログの一部であるデータセット。 @ja
domain: Catalog
label: conjunto de datos @es
label: datasæt @da
label: datová sada @cs
label: jeu de données @fr
label: σύνολο δεδομένων @el
label: قائمة بيانات @ar
label: データセット @ja
range: Dataset
sub property of: resource
alternative label: datasamling @da
alternative label: har datasæt @da
alternative label: has dataset
editorial note: Status: English Definition text modified by DCAT 3 revision team, translations pending.

distribuce
type: AnnotationProperty
type: ObjectProperty
comment: An available distribution of the dataset.
comment: Connecte un jeu de données à des distributions disponibles. @fr
comment: Dostupná distribuce datové sady. @cs
comment: En tilgængelig repræsentation af datasættet. @da
comment: Una distribución disponible del conjunto de datos. @es
comment: Una distribuzione disponibile per il set di dati. @it
comment: Συνδέει ένα σύνολο δεδομένων με μία από τις διαθέσιμες διανομές του. @el
comment: تربط قائمة البيانات بطريقة أو بشكل يسمح الوصول الى البيانات @ar
comment: データセットを、その利用可能な配信に接続します。 @ja
domain: Dataset
label: distribución @es
label: distribution
label: distribuzione @it
label: διανομή @el
label: توزيع @ar
label: データセット配信 @ja
range: Distribuce
sub property of: relation
inverse of: isDistributionOf
alternative label: har distribution @da
alternative label: has distribution
editorial note: Status: English Definition text modified by DCAT revision team, translations pending (except for Italian, Spanish and Czech).

download URL
type: ObjectProperty
comment: Ceci est un lien direct à un fichier téléchargeable en un format donnée. Exple fichier CSV ou RDF. Le format est décrit par les propriétés de distribution dcterms:format et/ou dcat:mediaType. @fr
comment: La URL de un archivo descargable en el formato dato. Por ejemplo, archivo CSV o archivo RDF. El formato se describe con las propiedades de la distribución dcterms:format y/o dcat:mediaType. @es
comment: Questo è un link diretto al file scaricabile in un dato formato. E.g. un file CSV o un file RDF. Il formato è descritto dal dcterms:format e/o dal dcat:mediaType della distribuzione. @it
comment: The URL of the downloadable file in a given format. E.g. CSV file or RDF file. The format is indicated by the distribution's dcterms:format and/or dcat:mediaType.
comment: URL souboru ke stažení v daném formátu, například CSV nebo RDF soubor. Formát je popsán vlastností distribuce dcterms:format a/nebo dcat:mediaType. @cs
comment: URL til fil der kan downloades i et bestemt format. Fx en CSV-fil eller en RDF-fil. Formatet for distributionen angives ved hjælp af egenskaberne dcterms:format og/eller dcat:mediaType. @da
comment: dcat:downloadURLはdcat:accessURLの特定の形式です。しかし、DCATプロファイルが非ダウンロード・ロケーションに対してのみaccessURLを用いる場合には、より強い分離を課すことを望む可能性があるため、この含意を強化しないように、DCATは、dcat:downloadURLをdcat:accessURLのサブプロパティーであると定義しません。 @ja
comment: Είναι ένας σύνδεσμος άμεσης μεταφόρτωσης ενός αρχείου σε μια δεδομένη μορφή. Π.χ. ένα αρχείο CSV ή RDF. Η μορφη αρχείου περιγράφεται από τις ιδιότητες dcterms:format ή/και dcat:mediaType της διανομής. @el
comment: رابط مباشر لملف يمكن تحميله. نوع الملف يتم توصيفه باستخدام الخاصية dcterms:format dcat:mediaType @ar
domain: Distribuce
label: URL de descarga @es
label: URL de téléchargement @fr
label: URL di scarico @it
label: URL souboru ke stažení @cs
label: URL μεταφόρτωσης @el
label: downloadURL @da
label: رابط تحميل @ar
label: ダウンロードURL @ja
range: Resource
editorial note: Status: English Definition text modified by DCAT revision team, Italian, Spanish and Czech translation updated, other translations pending.
editorial note: rdfs:label, rdfs:comment and/or skos:scopeNote have been modified. Non-english versions must be updated.
scope note: El valor es una URL. @es
scope note: La valeur est une URL. @fr
scope note: dcat:downloadURL BY MĚLA být použita pro adresu, ze které je distribuce přímo přístupná, typicky skrze požadavek HTTP Get. @cs
scope note: dcat:downloadURL BØR anvendes til angivelse af den adresse hvor distributionen er tilgængelig direkte, typisk gennem et HTTP Get request. @da
scope note: dcat:downloadURL DOVREBBE essere utilizzato per l'indirizzo a cui questa distribuzione è disponibile direttamente, in genere attraverso una richiesta Get HTTP. @it
scope note: dcat:downloadURL SHOULD be used for the address at which this distribution is available directly, typically through a HTTP Get request.
scope note: Η τιμή είναι ένα URL. @el

end date
type: DatatypeProperty
comment: El fin del período. @es
comment: Konec doby trvání. @cs
comment: La fine del periodo. @it
comment: Slutningen på perioden. @da
comment: The end of the period.
domain: PeriodOfTime
label: data di fine @it
label: datum konce @cs
label: fecha final @es
label: slutdato @da
range: Literal
alternative label: sluttidspunkt @da
change note: New property added in DCAT 2.
change note: Nová vlastnost přidaná ve verzi DCAT 2. @cs
change note: Nueva propiedad agregada en DCAT 2. @es
change note: Nuova proprietà aggiunta in DCAT 2. @it
change note: Ny egenskab i DCAT 2. @da
scope note: El rango de esta propiedad es intencionalmente genérico con el propósito de permitir distintos niveles de precisión temporal para especificar el fin del período. Por ejemplo, puede expresarse como una fecha (xsd:date), una fecha y un tiempo (xsd:dateTime), o un año (xsd:gYear). @es
scope note: La range di questa proprietà è volutamente generico, con lo scopo di consentire diversi livelli di precisione temporale per specificare la fine di un periodo. Ad esempio, può essere espresso con una data (xsd:date), una data e un'ora (xsd:dateTime), o un anno (xsd:gYear). @it
scope note: Obor hodnot této vlastnosti je úmyslně obecný, aby umožnil různé úrovně časového rozlišení pro specifikaci konce doby trvání. Ten může být kupříkladu vyjádřen datumem (xsd:date), datumem a časem (xsd:dateTime) či rokem (xsd:gYear). @cs
scope note: Rækkeviden for denne egenskab er bevidst generisk defineret med det formål at tillade forskellige niveauer af tidslig præcision ifm. angivelse af slutdatoen for en periode. Den kan eksempelvis udtrykkes som en dato (xsd:date), en dato og et tidspunkt (xsd:dateTime), eller et årstal (xsd:gYear). @da
scope note: The range of this property is intentionally generic, with the purpose of allowing different level of temporal precision for specifying the end of a period. E.g., it can be expressed with a date (xsd:date), a date and time (xsd:dateTime), or a year (xsd:gYear).

description of service end-point
type: ObjectProperty
comment: A description of the service end-point, including its operations, parameters etc.
comment: En beskrivelse af det pågældende tjenesteendpoint, inklusiv dets operationer, parametre etc. @da
comment: Popis přístupového bodu služby včetně operací, parametrů apod. @cs
comment: Una descripción del end-point del servicio, incluyendo sus operaciones, parámetros, etc. @es
comment: Una descrizione dell'endpoint del servizio, incluse le sue operazioni, parametri, ecc. @it
domain: Data service
label: descripción del end-point del servicio @es
label: descrizione dell'endpoint del servizio @it
label: endpointbeskrivelse @da
label: popis přístupového bodu služby @cs
change note: New property in DCAT 2.
change note: Nová vlastnost přidaná ve verzi DCAT 2. @cs
change note: Nueva propiedad agregada en DCAT 2.
change note: Nuova proprietà in DCAT 2. @it
change note: Ny egenskab i DCAT 2. @da
definition: Una descripción del end-point del servicio, incluyendo sus operaciones, parámetros, etc.. @es
scope note: An endpoint description may be expressed in a machine-readable form, such as an OpenAPI (Swagger) description, an OGC GetCapabilities response, a SPARQL Service Description, an OpenSearch or WSDL document, a Hydra API description, else in text or some other informal mode if a formal representation is not possible.
scope note: En beskrivelse af et endpoint kan udtrykkes i et maskinlæsbart format, såsom OpenAPI (Swagger)-beskrivelser, et OGC GetCapabilities svar, en SPARQL tjenestebeskrivelse, en OpenSearch- eller et WSDL-dokument, en Hydra-API-beskrivelse, eller i tekstformat eller i et andet uformelt format, hvis en formel repræsentation ikke er mulig. @da
scope note: Endpointbeskrivelsen giver specifikke oplysninger om den konkrete endpointinstans, mens dcterms:conformsTo anvendes til at indikere den overordnede standard eller specifikation som endpointet er i overensstemmelse med. @da
scope note: La descripción del endpoint brinda detalles específicos de la instancia del endpoint, mientras que dcterms:conformsTo se usa para indicar el estándar general o especificación que implementa el endpoint. @es
scope note: La descrizione dell'endpoint fornisce dettagli specifici dell'istanza dell'endpoint reale, mentre dcterms:conformsTo viene utilizzato per indicare lo standard o le specifiche implementate dall'endpoint. @it
scope note: Popis přístupového bodu dává specifické detaily jeho konkrétní instance, zatímco dcterms:conformsTo indikuje obecný standard či specifikaci kterou přístupový bod implementuje. @cs
scope note: Popis přístupového bodu může být vyjádřen ve strojově čitelné formě, například jako popis OpenAPI (Swagger), odpověď služby OGC getCapabilities, pomocí slovníku SPARQL Service Description, jako OpenSearch či WSDL document, jako popis API dle slovníku Hydra, a nebo textově nebo jiným neformálním způsobem, pokud není možno použít formální reprezentaci. @cs
scope note: The endpoint description gives specific details of the actual endpoint instance, while dcterms:conformsTo is used to indicate the general standard or specification that the endpoint implements.
scope note: Una descripción del endpoint del servicio puede expresarse en un formato que la máquina puede interpretar, tal como una descripción basada en OpenAPI (Swagger), una respuesta OGC GetCapabilities, una descripción de un servicio SPARQL, un documento OpenSearch o WSDL, una descripción con la Hydra API, o en texto u otro modo informal si la representación formal no es posible. @es
scope note: Una descrizione dell'endpoint può essere espressa in un formato leggibile dalla macchina, come una descrizione OpenAPI (Swagger), una risposta GetCapabilities OGC, una descrizione del servizio SPARQL, un documento OpenSearch o WSDL, una descrizione API Hydra, o con del testo o qualche altra modalità informale se una rappresentazione formale non è possibile. @it

service end-point
type: ObjectProperty
comment: Kořenové umístění nebo hlavní přístupový bod služby (IRI přístupné přes Web). @cs
comment: La locazione principale o l'endpoint primario del servizio (un IRI risolvibile via web). @it
comment: La posición raíz o end-point principal del servicio (una IRI web). @es
comment: Rodplaceringen eller det primære endpoint for en tjeneste (en web-resolverbar IRI). @da
comment: The root location or primary endpoint of the service (a web-resolvable IRI).
domain: Data service
label: end-point del servicio @es
label: end-point del servizio @it
label: přístupový bod služby @cs
label: tjenesteendpoint @da
range: Resource
change note: New property in DCAT 2.
change note: Nová vlastnost přidaná ve verzi DCAT 2. @cs
change note: Nueva propiedad agregada en DCAT 2. @es
change note: Nuova proprietà in DCAT 2. @it

first
type: ObjectProperty
comment: El primer recurso en una colección ordenada o serie de recursos, al que el recurso pertenece. @es
comment: La prima risorsa in una collezione ordinata o in una serie di risorse, di cui la risorsa fa parte. @it
comment: The first resource in an ordered collection or series of resources, to which the current resource belongs.
label: primero @es
label: primo @it
sub property of: first
change note: New property added in DCAT 3.
change note: Nová vlastnost přidaná ve verzi DCAT 3. @cs
change note: Nueva propiedad agregada in DCAT 3. @es
change note: Nuova proprietà aggiunta in DCAT 3. @it
change note: Ny egenskab tilføjet i DCAT 3. @da
scope note: En DCAT esta propiedad se usa para recursos que pertenecen a una dcat:DatasetSeries. @es
scope note: In DCAT questa proprietà è usata per risorse che fanno parte di una dcat:DatasetSeries. @it
scope note: In DCAT this property is used for resources belonging to a dcat:DatasetSeries.

hadRole
type: ObjectProperty
comment: Den funktion en entitet eller aktør har i forhold til en anden ressource. @da
comment: Funkce entity či agenta ve vztahu k jiné entitě či zdroji. @cs
comment: La función de una entidad o agente con respecto a otra entidad o recurso. @es
comment: La funzione di un'entità o un agente rispetto ad un'altra entità o risorsa. @it
comment: The function of an entity or agent with respect to another entity or resource.
domain: Class
  union of: Relationship
  union of: Attribution
label: haRuolo @it
label: havde rolle @da
label: sehraná role @cs
label: tiene rol @it
range: Rol
change note: New property added in DCAT 2.
change note: Nová vlastnost přidaná ve verzi DCAT 2. @cs
change note: Nueva propiedad agregada en DCAT 2. @es
change note: Nuova proprietà aggiunta in DCAT 2. @it
editorial note: Agregada en DCAT para complementar prov:hadRole (cuyo uso está limitado a roles en el contexto de una actividad, con dominio prov:Association. @es
editorial note: Introdotta in DCAT per completare prov:hadRole (il cui uso è limitato ai ruoli nel contesto di un'attività, con il dominio di prov:Association. @it
editorial note: Introduced into DCAT to complement prov:hadRole (whose use is limited to roles in the context of an activity, with the domain of prov:Association.
editorial note: Introduceret i DCAT for at supplere prov:hadRole (hvis anvendelse er begrænset til roller i forbindelse med en aktivitet med domænet prov:Association). @da
editorial note: Přidáno do DCAT pro doplnění vlastnosti prov:hadRole (jejíž užití je omezeno na role v kontextu aktivity, s definičním oborem prov:Association). @cs
scope note: Kan vendes ved kvalificerede krediteringer til at angive en aktørs rolle i forhold en entitet. Det anbefales at værdierne styres som et kontrolleret udfaldsrum med aktørroller, såsom http://registry.it.csiro.au/def/isotc211/CI_RoleCode. @da
scope note: May be used in a qualified-attribution to specify the role of an Agent with respect to an Entity. It is recommended that the value be taken from a controlled vocabulary of agent roles, such as http://registry.it.csiro.au/def/isotc211/CI_RoleCode.
scope note: May be used in a qualified-relation to specify the role of an Entity with respect to another Entity. It is recommended that the value be taken from a controlled vocabulary of entity roles such as: ISO 19115 DS_AssociationTypeCode http://registry.it.csiro.au/def/isotc211/DS_AssociationTypeCode; IANA Registry of Link Relations https://www.iana.org/assignments/link-relation; DataCite metadata schema; MARC relators https://id.loc.gov/vocabulary/relators.
scope note: Může být použito v kvalifikovaném přiřazení pro specifikaci role Agenta ve vztahu k Entitě. Je doporučeno hodnotu vybrat z řízeného slovníku rolí agentů, jako například http://registry.it.csiro.au/def/isotc211/CI_RoleCode. @cs
scope note: Může být použito v kvalifikovaném vztahu pro specifikaci role Entity ve vztahu k jiné Entitě. Je doporučeno použít hodnotu z řízeného slovníku rolí entit, jako například ISO 19115 DS_AssociationTypeCode http://registry.it.csiro.au/def/isotc211/DS_AssociationTypeCode, IANA Registry of Link Relations https://www.iana.org/assignments/link-relation, DataCite metadata schema, MARC relators https://id.loc.gov/vocabulary/relators. @cs
scope note: Puede usarse en una atribución cualificada para especificar el rol de un Agente con respecto a una Entidad. Se recomienda que el valor sea de un vocabulario controlado de roles de agentes, como por ejemplo http://registry.it.csiro.au/def/isotc211/CI_RoleCode. @es
scope note: Puede usarse en una atribución cualificada para especificar el rol de una Entidad con respecto a otra Entidad. Se recomienda que su valor se tome de un vocabulario controlado de roles de entidades como por ejemplo: ISO 19115 DS_AssociationTypeCode http://registry.it.csiro.au/def/isotc211/DS_AssociationTypeCode; IANA Registry of Link Relations https://www.iana.org/assignments/link-relation; esquema de metadatos de DataCite; MARC relators https://id.loc.gov/vocabulary/relators. @es
scope note: Può essere utilizzata in una relazione qualificata per specificare il ruolo di un'entità rispetto a un'altra entità. Si raccomanda che il valore sia preso da un vocabolario controllato di ruoli di entità come ISO 19115 DS_AssociationTypeCode http://registry.it.csiro.au/def/isotc211/DS_AssociationTypeCode, IANA Registry of Link Relations https://www.iana.org/assignments/link-relation, DataCite metadata schema, o MARC relators https://id.loc.gov/vocabulary/relators. @it
scope note: Può essere utilizzato in un'attribuzione qualificata per specificare il ruolo di un agente rispetto a un'entità. Si raccomanda che il valore sia preso da un vocabolario controllato di ruoli di agente, come ad esempio http://registry.it.csiro.au/def/isotc211/CI_RoleCode. @it

has current version
type: AnnotationProperty
type: ObjectProperty
comment: Este recurso es más específico y versionado con contenido equivalente [PAV]. @es
comment: Per questa risorsa esiste una risorsa più specifica e versionata, ma con lo stesso contenuto. @it
comment: This resource has a more specific, versioned resource with equivalent content [PAV].
label: ha versione attuale @it
label: tiene versión actual @es
sub property of: hasVersion
change note: New property added in DCAT 3.
change note: Nová vlastnost přidaná ve verzi DCAT 3. @cs
change note: Nueva propiedad agregada in DCAT 3. @es
change note: Nuova proprietà aggiunta in DCAT 3. @it
change note: Ny egenskab tilføjet i DCAT 3. @da
scope note: Esta propepiedad está destinada a relacionar un recurso no versionado o abstracto con una versión instantánea que puede usarse como un enlace permanente a la versión actual del recurso [PAV]. @es
scope note: La noción de versión que se usa en esta propiedad está limitada a las versiones que resultan de revisiones de un recurso como parte de su ciclo de vida. @es
scope note: La nozione di versione usata da questa proprietà è limitata a versioni risultanti da revisioni a cui una risorsa è soggetta nel suo ciclo di vita. @it
scope note: Questa proprietà è usata per correlare una risorsa non versionata o astratta a un suo specifico snapshot che può essere usato come permalink per indicare la versione attuale del suo contenuto. @it
scope note: The notion of version used by this property is limited to versions resulting from revisions occurring to a resource as part of its life-cycle.
scope note: This property is intended for relating a non-versioned or abstract resource to a single snapshot that can be used as a permalink to indicate the current version of the content [PAV].

has version
type: ObjectProperty
comment: Este recurso tiene una versión específica. @es
comment: Per questa risorsa esiste una risorsa più specifica e versionata. @it
comment: This resource has a more specific, versioned resource [PAV].
label: ha versione @it
label: tiene versión @es
sub property of: hasVersion
sub property of: generalizationOf
inverse of: isVersionOf
change note: New property added in DCAT 3.
change note: Nová vlastnost přidaná ve verzi DCAT 3. @cs
change note: Nueva propiedad agregada in DCAT 3. @es
change note: Nuova proprietà aggiunta in DCAT 3. @it
change note: Ny egenskab tilføjet i DCAT 3. @da
scope note: Esta propiedad se utiliza para relacionar un recurso abstracto o no versionado de un recurso con varias versiones del recuros; por ejemplo, versiones intastáneas. @es
scope note: La noción de versión que se usa en esta propiedad está limitada a las versiones que resultan de revisiones de un recurso como parte de su ciclo de vida. Por lo tanto, su semántica es más específica que su super-propiedad dcterns:hasVersion, la cuál hace uso de la noción más amplia de versión, incluyendo ediciones y adaptaciones. @es
scope note: La nozione di versione usata da questa proprietà è limitata a versioni risultanti da revisioni a cui una risorsa è soggetta nel suo ciclo di vita. Quindi la sua semantica è più specifica di quella della sua super-proprietà dcterms:hasVersion, che utilizza una nozione di versione più ampia, e include, ad es., edizioni e adattamenti. @it
scope note: Questa proprietà è usata per correlare una risorsa non versionata o astratta a differenti risorse versionate, ad es., i relativi snapshot. @it
scope note: The notion of version used by this property is limited to versions resulting from revisions occurring to a resource as part of its life-cycle. Therefore, its semantics is more specific than its super-property dcterms:hasVersion, which makes use of a broader notion of version, including editions and adaptations.
scope note: This property is intended for relating a non-versioned or abstract resource to several versioned resources, e.g., snapshots [PAV].

inCatalog
type: ObjectProperty
inverse of: resource
change note: New property added in DCAT 3.
change note: Nová vlastnost přidaná ve verzi DCAT 3. @cs
change note: Nueva propiedad agregada en DCAT 3. @es
change note: Nuova proprietà aggiunta in DCAT 3. @it
scope note: Esta propiedad inversa PUEDE usarse sólo en combinación con su inversa, y NO PUEDE utilizarse en su reemplazo. @es
scope note: Questa proprietà PUÒ essere usata solo insieme alla sua inversa, e NON DEVE essere usata per sostituirla. @it
scope note: This property MAY be used only in addition to its inverse, and it MUST NOT be used to replace it.

in series
type: AnnotationProperty
type: ObjectProperty
comment: A dataset series of which the dataset is part.
comment: Una serie de conjuntos de datos del cuál un conjunto de datos es parte. @es
comment: Una serie di dataset di cui questo dataset fa parte. @it
label: en serie @es
label: in serie @it
sub property of: isPartOf
inverse of: seriesMember
change note: New property added in DCAT 3.
change note: Nová vlastnost přidaná ve verzi DCAT 3. @cs
change note: Nueva propiedad agregada in DCAT 3. @es
change note: Nuova proprietà aggiunta in DCAT 3. @it
change note: Ny egenskab tilføjet i DCAT 3. @da

isDistributionOf
type: ObjectProperty
change note: New property added in DCAT 3.
change note: Nová vlastnost přidaná ve verzi DCAT 3. @cs
change note: Nueva propiedad agregada en DCAT 3. @es
change note: Nuova proprietà aggiunta in DCAT 3. @it
scope note: Esta propiedad inversa PUEDE usarse sólo en combinación con su inversa, y NO PUEDE utilizarse en su reemplazo. @es
scope note: Questa proprietà PUÒ essere usata solo insieme alla sua inversa, e NON DEVE essere usata per sostituirla. @it
scope note: This property MAY be used only in addition to its inverse, and it MUST NOT be used to replace it.

isVersionOf
type: ObjectProperty
change note: New property added in DCAT 3.
change note: Nová vlastnost přidaná ve verzi DCAT 3. @cs
change note: Nueva propiedad agregada en DCAT 3. @es
change note: Nuova proprietà aggiunta in DCAT 3. @it
scope note: Esta propiedad inversa PUEDE usarse sólo en combinación con su inversa, y NO PUEDE utilizarse en su reemplazo. @es
scope note: Questa proprietà PUÒ essere usata solo insieme alla sua inversa, e NON DEVE essere usata per sostituirla. @it
scope note: This property MAY be used only in addition to its inverse, and it MUST NOT be used to replace it.

keyword
type: DatatypeProperty
comment: A keyword or tag describing a resource.
comment: Et nøgleord eller tag til beskrivelse af en ressource. @da
comment: Klíčové slovo nebo značka popisující zdroj. @cs
comment: Un mot-clé ou étiquette décrivant une ressource. @fr
comment: Una palabra clave o etiqueta que describe un recurso. @es
comment: Una parola chiave o un'etichetta per descrivere la risorsa. @it
comment: Μία λέξη-κλειδί ή μία ετικέτα που περιγράφει το σύνολο δεδομένων. @el
comment: كلمة مفتاحيه توصف قائمة البيانات @ar
comment: データセットを記述しているキーワードまたはタグ。 @ja
label: klíčové slovo @cs
label: mot-clés @fr
label: nøgleord @da
label: palabra clave @es
label: parola chiave @it
label: λέξη-κλειδί @el
label: كلمة مفتاحية @ar
label: キーワード/タグ @ja
range: Literal

landing page
type: ObjectProperty
comment: A Web page that can be navigated to in a Web browser to gain access to the catalog, a dataset, its distributions and/or additional information.
comment: En webside som der kan navigeres til i en webbrowser for at få adgang til kataloget, et datasæt, dets distributioner og/eller yderligere information. @da
comment: Una pagina web che può essere navigata per ottenere l'accesso al catalogo, ad un dataset, alle distribuzioni del dataset e/o ad informazioni addizionali. @it
comment: Una página web que puede ser visitada en un explorador Web para tener acceso el catálogo, un conjunto de datos, sus distribuciones y/o información adicional. @es
comment: Une page Web accessible par un navigateur Web donnant accès au catalogue, un jeu de données, ses distributions et/ou des informations additionnelles. @fr
comment: Webová stránka, na kterou lze pro získání přístupu ke katalogu, datové sadě, jejím distribucím a/nebo dalším informacím přistoupit webovým prohlížečem. @cs
comment: Μία ιστοσελίδα πλοηγίσιμη μέσω ενός φυλλομετρητή (Web browser) που δίνει πρόσβαση στο σύνολο δεδομένων, τις διανομές αυτού ή/και επιπρόσθετες πληροφορίες. @el
comment: صفحة وب يمكن من خلالها الوصول الى قائمة البيانات أو إلى معلومات إضافية متعلقة بها @ar
comment: データセット、その配信および（または）追加情報にアクセスするためにウエブ・ブラウザでナビゲートできるウェブページ。 @ja
label: destinationsside @da
label: page d'atterrissage @fr
label: pagina di destinazione @it
label: página de destino @es
label: vstupní stránka @cs
label: ιστοσελίδα αρχικής πρόσβασης @el
label: صفحة وصول @ar
label: ランディング・ページ @ja
range: Document
sub property of: page
definition: En webside som en webbrowser kan navigeres til for at få adgang til kataloget, et datasæt, dets distritbutioner og/eller yderligere information. @da
scope note: Hvis en eller flere distributioner kun er tilgængelige via en destinationsside (dvs. en URL til direkte download er ikke kendt), så bør destinationssidelinket gentages som adgangsadresse for en distribution. @da
scope note: If the distribution(s) are accessible only through a landing page (i.e. direct download URLs are not known), then the landing page link should be duplicated as accessURL on a distribution.
scope note: Pokud je distribuce dostupná pouze přes vstupní stránku, t.j. přímý URL odkaz ke stažení není znám, URL přístupové stránky by mělo být duplikováno ve vlastnosti distribuce accessURL. @cs
scope note: Se la distribuzione è accessibile solo attraverso una pagina di destinazione (cioè, un URL di download diretto non è noto), il link alla pagina di destinazione deve essere duplicato come accessURL sulla distribuzione. @it
scope note: Si la distribución es accesible solamente través de una página de aterrizaje (i.e., no se conoce una URL de descarga directa), entonces el enlance a la página de aterrizaje debe ser duplicado como accessURL sobre la distribución. @es
scope note: Si la distribution est seulement accessible à travers une page d'atterrissage (exple. pas de connaissance d'URLS de téléchargement direct ), alors le lien de la page d'atterrissage doit être dupliqué comme accessURL sur la distribution. @fr
scope note: Αν η/οι διανομή/ές είναι προσβάσιμη/ες μόνο μέσω μίας ιστοσελίδας αρχικής πρόσβασης (δηλαδή αν δεν υπάρχουν γνωστές διευθύνσεις άμεσης μεταφόρτωσης), τότε ο σύνδεσμος της ιστοσελίδας αρχικής πρόσβασης πρέπει να αναπαραχθεί ως accessURL σε μία διανομή. @el
scope note: ランディング・ページを通じてしか配信にアクセスできない場合（つまり、直接的なダウンロードURLが不明）には、配信におけるaccessURLとしてランディング・ページのリンクをコピーすべきです（SHOULD）。 @ja

last
type: AnnotationProperty
type: ObjectProperty
comment: El último recurso en una colección ordenada o serie de recursos, al que el recurso pertenece. @es
comment: L'ultima risorsa in una collezione ordinata o in una serie di risorse, di cui la risorsa fa parte. @it
comment: The last resource in an ordered collection or series of resources, to which the current resource belongs.
label: ultimo @it
label: último @es
sub property of: last
change note: New property added in DCAT 3.
change note: Nová vlastnost přidaná ve verzi DCAT 3. @cs
change note: Nueva propiedad agregada in DCAT 3. @es
change note: Nuova proprietà aggiunta in DCAT 3. @it
change note: Ny egenskab tilføjet i DCAT 3. @da
scope note: En DCAT esta propiedad se usa para recursos que pertenecen a una dcat:DatasetSeries. @es
scope note: In DCAT questa proprietà è usata per risorse che fanno parte di una dcat:DatasetSeries. @it
scope note: In DCAT this property is used for resources belonging to a dcat:DatasetSeries.

media type
type: ObjectProperty
comment: Cette propriété doit être utilisée quand c'est définit le type de média de la distribution en IANA, sinon dcterms:format DOIT être utilisé avec différentes valeurs. @fr
comment: Esta propiedad debe ser usada cuando está definido el tipo de media de la distribución en IANA, de otra manera dcterms:format puede ser utilizado con diferentes valores @es
comment: Il tipo di media della distribuzione come definito da IANA @it
comment: Medietypen for distributionen som den er defineret af IANA. @da
comment: The media type of the distribution as defined by IANA
comment: Typ média distribuce definovaný v IANA. @cs
comment: Η ιδιότητα αυτή ΘΑ ΠΡΕΠΕΙ να χρησιμοποιείται όταν ο τύπος μέσου μίας διανομής είναι ορισμένος στο IANA, αλλιώς η ιδιότητα dcterms:format ΔΥΝΑΤΑΙ να χρησιμοποιηθεί με διαφορετικές τιμές. @el
comment: يجب استخدام هذه الخاصية إذا كان نوع الملف معرف ضمن IANA @ar
comment: このプロパティーは、配信のメディア・タイプがIANAで定義されているときに使用すべきで（SHOULD）、そうでない場合には、dcterms:formatを様々な値と共に使用できます（MAY）。 @ja
domain: Distribuce
label: medietype @da
label: tipo de media @es
label: tipo di media @it
label: typ média @cs
label: type de média @fr
label: τύπος μέσου @el
label: نوع الميديا @ar
label: メディア・タイプ @ja
range: MediaType
sub property of: format
change note: Il range di dcat:mediaType è stato ristretto come parte della revisione di DCAT. @it
change note: Obor hodnot dcat:mediaType byl zúžen v této revizi DCAT. @cs
change note: The range of dcat:mediaType has been tightened as part of the revision of DCAT.
definition: Esta propiedad debe ser usada cuando está definido el tipo de media de la distribución en IANA, de otra manera dcterms:format puede ser utilizado con diferentes valores. @es
definition: Il tipo di media della distribuzione come definito da IANA. @it
definition: The media type of the distribution as defined by IANA.
editorial note: Status: English Definition text modified by DCAT revision team, Italian and Czech translation provided, other translations pending. Note some inconsistency on def vs. usage.
scope note: Denne egenskab BØR anvendes hvis distributionens medietype optræder i 'IANA media types registry' https://www.iana.org/assignments/media-types/, ellers KAN egenskaben dcterms:format anvendes med et andet udfaldsrum. @da
scope note: Esta propiedad DEBERÍA usarse cuando el 'media type' de la distribución está definido en el registro IANA de 'media types' https://www.iana.org/assignments/media-types/, de lo contrario, dcterms:format PUEDE usarse con distintos valores. @es
scope note: Questa proprietà DEVE essere usata quando il tipo di media della distribuzione è definito nel registro dei tipi di media IANA https://www.iana.org/assignments/media-types/, altrimenti dcterms:format PUO 'essere usato con differenti valori. @it
scope note: Tato vlastnost BY MĚLA být použita, je-li typ média distribuce definován v registru IANA https://www.iana.org/assignments/media-types/. V ostatních případech MŮŽE být použita vlastnost dcterms:format s jinými hodnotami. @cs
scope note: This property SHOULD be used when the media type of the distribution is defined in the IANA media types registry https://www.iana.org/assignments/media-types/, otherwise dcterms:format MAY be used with different values.

next
type: ObjectProperty
inverse of: previous
change note: New property added in DCAT 3.
change note: Nová vlastnost přidaná ve verzi DCAT 3. @cs
change note: Nueva propiedad agregada en DCAT 3. @es
change note: Nuova proprietà aggiunta in DCAT 3. @it
scope note: Esta propiedad inversa PUEDE usarse sólo en combinación con su inversa, y NO PUEDE utilizarse en su reemplazo. @es
scope note: Questa proprietà PUÒ essere usata solo insieme alla sua inversa, e NON DEVE essere usata per sostituirla. @it
scope note: This property MAY be used only in addition to its inverse, and it MUST NOT be used to replace it.

nextVersion
type: ObjectProperty
inverse of: previous version
change note: New property added in DCAT 3.
change note: Nová vlastnost přidaná ve verzi DCAT 3. @cs
change note: Nueva propiedad agregada en DCAT 3. @es
change note: Nuova proprietà aggiunta in DCAT 3. @it
scope note: Esta propiedad inversa PUEDE usarse sólo en combinación con su inversa, y NO PUEDE utilizarse en su reemplazo. @es
scope note: Questa proprietà PUÒ essere usata solo insieme alla sua inversa, e NON DEVE essere usata per sostituirla. @it
scope note: This property MAY be used only in addition to its inverse, and it MUST NOT be used to replace it.

packaging format
type: ObjectProperty
comment: Balíčkový formát souboru, ve kterém je jeden či více souborů seskupeno dohromady, např. aby bylo možné stáhnout sadu souvisejících souborů naráz. @cs
comment: El formato del archivo en que se agrupan uno o más archivos de datos, e.g. para permitir que un conjunto de archivos relacionados se bajen juntos. @es
comment: Format til pakning af data med henblik på distribution af en eller flere relaterede datafiler der samles til en enhed med henblik på samlet distribution. @da
comment: Il formato di impacchettamento della distribuzione in cui uno o più file di dati sono raggruppati insieme, ad es. per abilitare un insieme di file correlati da scaricare insieme. @it
comment: The package format of the distribution in which one or more data files are grouped together, e.g. to enable a set of related files to be downloaded together.
domain: Distribuce
label: formato de empaquetado @es
label: formato di impacchettamento @it
label: formát balíčku @cs
label: pakkeformat @da
range: MediaType
sub property of: format
change note: New property added in DCAT 2.
change note: Nová vlastnost přidaná ve verzi DCAT 2. @cs
change note: Nueva propiedad agregada en DCAT 2. @es
change note: Nuova proprietà aggiunta in DCAT 2. @it
change note: Ny egenskab tilføjet i DCAT 2. @da
scope note: Denne egenskab kan anvendes hvis filerne i en distribution er pakket, fx i en TAR-fil, en Frictionless Data Package eller en Bagit-fil. Formatet BØR udtrykkes ved en medietype som defineret i 'IANA media types registry', hvis der optræder en relevant medietype dér: https://www.iana.org/assignments/media-types/. @da
scope note: Esta propiedad se debe usar cuando los archivos de la distribución están empaquetados, por ejemplo en un archivo TAR, Frictionless Data Package o Bagit. El formato DEBERÍA expresarse usando un 'media type', tales como los definidos en el registro IANA de 'media types' https://www.iana.org/assignments/media-types/, si está disponibles. @es
scope note: Questa proprietà deve essere utilizzata quando i file nella distribuzione sono impacchettati, ad esempio in un file TAR, Frictionless Data Package o Bagit. Il formato DOVREBBE essere espresso utilizzando un tipo di supporto come definito dal registro dei tipi di media IANA https://www.iana.org/assignments/media-types/, se disponibili. @it
scope note: Tato vlastnost se použije, když jsou soubory v distribuci zabaleny, např. v souboru TAR, v balíčku Frictionless Data Package nebo v souboru Bagit. Formát BY MĚL být vyjádřen pomocí typu média definovaného v registru IANA https://www.iana.org/assignments/media-types/, pokud existuje. @cs
scope note: This property to be used when the files in the distribution are packaged, e.g. in a TAR file, a Frictionless Data Package or a Bagit file. The format SHOULD be expressed using a media type as defined by IANA media types registry https://www.iana.org/assignments/media-types/, if available.

previous
type: ObjectProperty
comment: La risorsa precedente a quella attuale in una collezione ordinata o in una serie di risorse. @it
comment: The previous resource (before the current one) in an ordered collection or series of resources.
label: precedente @it
label: previo @es
sub property of: prev
change note: New property added in DCAT 3.
change note: Nová vlastnost přidaná ve verzi DCAT 3. @cs
change note: Nueva propiedad agregada in DCAT 3. @es
change note: Nuova proprietà aggiunta in DCAT 3. @it
change note: Ny egenskab tilføjet i DCAT 3. @da
scope note: En DCAT esta propiedad se usa para recursos que pertenecen a una dcat:DatasetSeries. @es
scope note: In DCAT questa proprietà è usata per risorse che fanno parte di una dcat:DatasetSeries. @it
scope note: In DCAT this property is used for resources belonging to a dcat:DatasetSeries.
scope note: It is important to note that this property is different from dcat:previousVersion, as it does not denote a previous version of the same resource, but a distinct resource immediately preceding the current one in an ordered collection of resources.
scope note: È importante notare che questa proprietà è diversa da dcat:previousVersion, dato che non indica una versione precedente della stessa risorsa, ma una risorsa distinta che precede immediatamente quella attuale in una collezione ordinata di risorse. @it

previous version
type: ObjectProperty
comment: La versione precedente di una risorsa. @it
comment: The previous version of a resource in a lineage [PAV].
label: versione precedente @it
label: versión anterior @es
sub property of: wasRevisionOf
change note: New property added in DCAT 3.
change note: Nová vlastnost přidaná ve verzi DCAT 3. @cs
change note: Nueva propiedad agregada in DCAT 3. @es
change note: Nuova proprietà aggiunta in DCAT 3. @it
change note: Ny egenskab tilføjet i DCAT 3. @da
scope note: La nozione di versione usata da questa proprietà è limitata a versioni risultanti da revisioni a cui una risorsa è soggetta nel suo ciclo di vita. Uno dei casi tipici è la rappresentazione della storia delle versioni di un dataset, che sono state pubblicate nel corso del tempo. @it
scope note: Questa proprietà è usata per specificare una catena di versioni, costituita da snapshot di una risorsa. @it
scope note: The notion of version used by this property is limited to versions resulting from revisions occurring to a resource as part of its life-cycle. One of the typical cases here is representing the history of the versions of a dataset that have been released over time.
scope note: This property is meant to be used to specify a version chain, consisting of snapshots of a resource.

qualified relation
type: ObjectProperty
comment: Enlace a una descripción de la relación con otro recurso. @es
comment: Link a una descrizione di una relazione con un'altra risorsa. @it
comment: Link to a description of a relationship with another resource.
comment: Odkaz na popis vztahu s jiným zdrojem. @cs
comment: Reference til en beskrivelse af en relation til en anden ressource. @da
domain: Catalogued resource
label: Kvalificeret relation @da
label: kvalifikovaný vztah @cs
label: relación calificada @es
label: relazione qualificata @it
range: Relationship
change note: New property added in DCAT 2.
change note: Nová vlastnost přidaná ve verzi DCAT 2. @cs
change note: Nuova proprietà aggiunta in DCAT 2. @it
change note: Ny egenskab tilføjet i DCAT 2. @da
change note: Propiedad nueva añadida en DCAT 2. @es
editorial note: Introdotta in DCAT per integrare le altre relazioni qualificate di PROV. @it
editorial note: Introduced into DCAT to complement the other PROV qualified relations.
editorial note: Introduceret i DCAT med henblik på at supplere de øvrige kvalificerede relationer fra PROV. @da
editorial note: Přidáno do DCAT k doplnění jiných kvalifikovaných vztahů ze slovníku PROV. @cs
editorial note: Se incluyó en DCAT para complementar las relaciones calificadas disponibles en PROV. @es
scope note: Anvendes til at referere til en anden ressource hvor relationens betydning er kendt men ikke matcher en af de standardiserede egenskaber fra Dublin Core (dcterms:hasPart, dcterms:isPartOf, dcterms:conformsTo, dcterms:isFormatOf, dcterms:hasFormat, dcterms:isVersionOf, dcterms:hasVersion, dcterms:replaces, dcterms:isReplacedBy, dcterms:references, dcterms:isReferencedBy, dcterms:requires, dcterms:isRequiredBy) eller PROV-O-egenskaber (prov:wasDerivedFrom, prov:wasInfluencedBy, prov:wasQuotedFrom, prov:wasRevisionOf, prov:hadPrimarySource, prov:alternateOf, prov:specializationOf). @da
scope note: Použito pro odkazování na jiný zdroj, kde druh vztahu je znám, ale neodpovídá standardním vlastnostem ze slovníku Dublin Core (dcterms:hasPart, dcterms:isPartOf, dcterms:conformsTo, dcterms:isFormatOf, dcterms:hasFormat, dcterms:isVersionOf, dcterms:hasVersion, dcterms:replaces, dcterms:isReplacedBy, dcterms:references, dcterms:isReferencedBy, dcterms:requires, dcterms:isRequiredBy) či slovníku PROV-O (prov:wasDerivedFrom, prov:wasInfluencedBy, prov:wasQuotedFrom, prov:wasRevisionOf, prov:hadPrimarySource, prov:alternateOf, prov:specializationOf). @cs
scope note: Se usa para asociar con otro recurso para el cuál la naturaleza de la relación es conocida pero no es ninguna de las propiedades que provee el estándar Dublin Core (dcterms:hasPart, dcterms:isPartOf, dcterms:conformsTo, dcterms:isFormatOf, dcterms:hasFormat, dcterms:isVersionOf, dcterms:hasVersion, dcterms:replaces, dcterms:isReplacedBy, dcterms:references, dcterms:isReferencedBy, dcterms:requires, dcterms:isRequiredBy) or PROV-O properties (prov:wasDerivedFrom, prov:wasInfluencedBy, prov:wasQuotedFrom, prov:wasRevisionOf, prov:hadPrimarySource, prov:alternateOf, prov:specializationOf). @es
scope note: Used to link to another resource where the nature of the relationship is known but does not match one of the standard Dublin Core properties (dcterms:hasPart, dcterms:isPartOf, dcterms:conformsTo, dcterms:isFormatOf, dcterms:hasFormat, dcterms:isVersionOf, dcterms:hasVersion, dcterms:replaces, dcterms:isReplacedBy, dcterms:references, dcterms:isReferencedBy, dcterms:requires, dcterms:isRequiredBy) or PROV-O properties (prov:wasDerivedFrom, prov:wasInfluencedBy, prov:wasQuotedFrom, prov:wasRevisionOf, prov:hadPrimarySource, prov:alternateOf, prov:specializationOf).
scope note: Viene utilizzato per associarsi a un'altra risorsa nei casi per i quali la natura della relazione è nota ma non è alcuna delle proprietà fornite dallo standard Dublin Core (dcterms:hasPart, dcterms:isPartOf, dcterms:conformsTo, dcterms:isFormatOf, dcterms:hasFormat , dcterms:isVersionOf, dcterms:hasVersion, dcterms:replaces, dcterms:isReplacedBy, dcterms:references, dcterms:isReferencedBy, dcterms:require, dcterms:isRequiredBy) o dalle proprietà fornite da PROV-O (prov:wasDerivedFrom, prov:wasInfluencedBy, prov:wasQuotedFrom , prov:wasRevisionOf, prov:hadPrimarySource, prov:alternateOf, prov:specializationOf). @it

record
type: ObjectProperty
comment: A record describing the registration of a single dataset or data service that is part of the catalog.
comment: Describe la registración de un conjunto de datos o un servicio de datos en el catálogo. @es
comment: En post der beskriver registreringen af et enkelt datasæt eller en datatjeneste som er opført i kataloget. @da
comment: Propojuje katalog a jeho záznamy. @cs
comment: Relie un catalogue à ses registres. @fr
comment: Un record che descrive la registrazione di un singolo set di dati o di un servizio dati che fa parte del catalogo. @it
comment: Záznam popisující registraci jedné datové sady či datové služby jakožto součásti katalogu. @cs
comment: Συνδέει έναν κατάλογο με τις καταγραφές του. @el
comment: تربط الفهرس بسجل ضمنه @ar
comment: カタログの一部であるカタログ・レコード。 @ja
domain: Catalog
label: post @da
label: registre @fr
label: registro @es
label: záznam @cs
label: καταγραφή @el
label: سجل @ar
label: カタログ・レコード @ja
range: Catalog Record
alternative label: har post @da
editorial note: Status: English, Italian, Spanish and Czech Definitions modified by DCAT revision team, other translations pending.

resource
type: ObjectProperty
comment: A resource that is listed in the catalog.
comment: Una risorsa elencata nel catalogo. @it
domain: Catalog
label: risorsa @it
range: Catalogued resource
sub property of: hasPart
change note: New property added in DCAT 3.
change note: Nová vlastnost přidaná ve verzi DCAT 3. @cs
change note: Nueva propiedad agregada en DCAT 3. @es
change note: Nuova proprietà aggiunta in DCAT 3. @it
editorial note: Status: English Definition text modified by DCAT 3 revision team, translations pending.
scope note: Questo è il predicate più generale per indicare l'appartenenza di una risorsa a un catalogo. Si raccomanda l'uso di una proprietà più specifica, quando disponibile. @it
scope note: See also: Sub-properties of dcat:resource in particular dcat:dataset, dcat:catalog, dcat:service.
scope note: This is the most general predicate for membership of a catalog. Use of a more specific sub-property is recommended when available.
scope note: Vd. anche: Le sottoproprietà di dcat:resource, in particolare: dcat:dataset, dcat:catalog, dcat:service. @it

seriesMember
type: ObjectProperty
change note: New property added in DCAT 3.
change note: Nová vlastnost přidaná ve verzi DCAT 3. @cs
change note: Nueva propiedad agregada en DCAT 3. @es
change note: Nuova proprietà aggiunta in DCAT 3. @it
scope note: Esta propiedad inversa PUEDE usarse sólo en combinación con su inversa, y NO PUEDE utilizarse en su reemplazo. @es
scope note: Questa proprietà PUÒ essere usata solo insieme alla sua inversa, e NON DEVE essere usata per sostituirla. @it
scope note: This property MAY be used only in addition to its inverse, and it MUST NOT be used to replace it.

serves dataset
type: ObjectProperty
comment: A collection of data that this DataService can distribute.
comment: En samling af data som denne datatjeneste kan distribuere. @da
comment: Kolekce dat, kterou je tato Datová služba schopna poskytnout. @cs
comment: Una colección de datos que este Servicio de Datos puede distribuir. @es
comment: Una raccolta di dati che questo DataService può distribuire. @it
domain: Data service
label: datatjeneste for datasæt @da
label: poskytuje datovou sadu @cs
label: provee conjunto de datos @es
label: serve set di dati @it
range: Dataset
alternative label: distribuerer @da
alternative label: ekspederer @da
alternative label: udstiller @da
change note: New property in DCAT 2.
change note: Nová vlastnost přidaná ve verzi DCAT 2. @cs
change note: Nueva propiedad agregada en DCAT 2. @es
change note: Nuova proprietà in DCAT 2. @it

service
type: ObjectProperty
comment: A service that is listed in the catalog.
comment: Et websted eller et endpoint som er opført i kataloget. @da
comment: Umístění či přístupový bod registrovaný v katalogu. @cs
comment: Un sitio o 'endpoint' que está listado en el catálogo. @es
comment: Un sito o endpoint elencato nel catalogo. @it
domain: Catalog
label: datatjeneste @da
label: servicio @es
label: servizio @it
label: služba @cs
range: Data service
sub property of: resource
alternative label: har datatjeneste @da
alternative label: has service
change note: New property added in DCAT 2.
change note: Nová vlastnost přidaná ve verzi DCAT 2. @cs
change note: Nueva propiedad añadida en DCAT 2. @es
change note: Nuova proprietà aggiunta in DCAT 2. @it
editorial note: Status: English Definition text modified by DCAT 3 revision team, translations pending.

spatial resolution (meters)
type: DatatypeProperty
comment: mindste geografiske afstand som kan erkendes i et datasæt, målt i meter. @da
comment: minimum spatial separation resolvable in a dataset, measured in meters.
comment: minimum spatial separation resolvable in a dataset, measured in metres.
comment: minimální prostorový rozestup rozeznatelný v datové sadě, měřeno v metrech. @cs
comment: mínima separacíon espacial disponible en un conjunto de datos, medida en metros. @es
comment: separazione spaziale minima risolvibile in un set di dati, misurata in metri. @it
label: geografisk opløsning (meter) @da
label: prostorové rozlišení (metry) @cs
label: resolución espacial (metros) @es
label: risoluzione spaziale (metri) @it
label: spatial resolution (metres)
range: decimal
change note: New property added in DCAT 2.
change note: Nová vlastnost přidaná ve verzi DCAT 2. @cs
change note: Nueva propiedad añadida en DCAT 2. @es
change note: Nuova proprietà aggiunta in DCAT 2. @it
change note: Ny genskab tilføjet i DCAT 2. @da
definition: mindste geografiske afstand som kan resolveres i et datasæt, målt i meter. @da
editorial note: Kan optræde i forbindelse med beskrivelse af datasættet eller datasætditributionen, så der er ikke angivet et domæne for egenskaben. @da
editorial note: Might appear in the description of a Dataset or a Distribution, so no domain is specified.
editorial note: Může se vyskytnout v popisu Datové sady nebo Distribuce, takže nebyl specifikován definiční obor. @cs
scope note: Alternative geografiske opløsninger kan leveres som forskellige datasætdistributioner. @da
scope note: Alternative spatial resolutions might be provided as different dataset distributions.
scope note: Distintas distribuciones de un conjunto de datos pueden tener resoluciones espaciales diferentes. @es
scope note: Hvis datasættet udgøres af et billede eller et grid, så bør dette svare til afstanden mellem elementerne. For andre typer af spatiale datasæt, vil denne egenskab typisk indikere den mindste afstand mellem elementerne i datasættet. @da
scope note: If the dataset is an image or grid this should correspond to the spacing of items. For other kinds of spatial dataset, this property will usually indicate the smallest distance between items in the dataset.
scope note: Pokud je datová sada obraz či mřížka, měla by tato vlastnost odpovídat rozestupu položek. Pro ostatní druhy prostorových datových sad bude tato vlastnost obvykle indikovat nejmenší vzdálenost mezi položkami této datové sady. @cs
scope note: Risoluzioni spaziali alternative possono essere fornite come diverse distribuzioni di set di dati. @it
scope note: Různá prostorová rozlišení mohou být poskytována jako různé distribuce datové sady. @cs
scope note: Se il set di dati è un'immagine o una griglia, questo dovrebbe corrispondere alla spaziatura degli elementi. Per altri tipi di set di dati spaziali, questa proprietà di solito indica la distanza minima tra gli elementi nel set di dati. @it
scope note: Si el conjunto de datos es una imágen o grilla, esta propiedad corresponde al espaciado de los elementos. Para otro tipo de conjunto de datos espaciales, esta propieda usualmente indica la menor distancia entre los elementos de dichos datos. @es

start date
type: DatatypeProperty
domain: PeriodOfTime
label: data di inizio @it
label: datum začátku @cs
label: startdato @da
range: Literal
alternative label: starttidspunkt @da
change note: New property added in DCAT 2.
change note: Nová vlastnost přidaná ve verzi DCAT 2. @cs
change note: Nueva propiedad agregada en DCAT 2. @es
change note: Nuova proprietà aggiunta in DCAT 2. @it
change note: Ny egenskab tilføjet i DCAT 2. @da
definition: El comienzo del período @es
definition: L'inizio del periodo @it
definition: Start på perioden. @da
definition: The start of the period
definition: Začátek doby trvání @cs
scope note: El rango de esta propiedad es intencionalmente genérico con el propósito de permitir distintos niveles de precisión temporal para especificar el comienzo de un período. Por ejemplo, puede expresarse como una fecha (xsd:date), una fecha y un tiempo (xsd:dateTime), o un año (xsd:gYear). @es
scope note: Il range di questa proprietà è volutamente generico, con lo scopo di consentire diversi livelli di precisione temporale per specificare l'inizio di un periodo. Ad esempio, può essere espresso con una data (xsd:date), una data e un'ora (xsd:dateTime), o un anno (xsd:gYear). @it
scope note: Obor hodnot této vlastnosti je úmyslně obecný, aby umožnil různé úrovně časového rozlišení pro specifikaci začátku doby trvání. Ten může být kupříkladu vyjádřen datumem (xsd:date), datumem a časem (xsd:dateTime) či rokem (xsd:gYear). @cs
scope note: Rækkeviden for denne egenskab er bevidst generisk defineret med det formål at tillade forskellige niveauer af tidslig præcision ifm. angivelse af startdatoen for en periode. Den kan eksempelvis udtrykkes som en dato (xsd:date), en dato og et tidspunkt (xsd:dateTime), eller et årstal (xsd:gYear). @da
scope note: The range of this property is intentionally generic, with the purpose of allowing different level of temporal precision for specifying the start of a period. E.g., it can be expressed with a date (xsd:date), a date and time (xsd:dateTime), or a year (xsd:gYear).

temporal resolution
type: DatatypeProperty
comment: mindste tidsperiode der kan resolveres i datasættet. @da
comment: minimum time period resolvable in a dataset.
comment: minimální doba trvání rozlišitelná v datové sadě. @cs
comment: periodo di tempo minimo risolvibile in un set di dati. @it
comment: período de tiempo mínimo en el conjunto de datos. @es
label: resolución temporal @es
label: risoluzione temporale @it
label: tidslig opløsning @da
label: časové rozlišení @cs
range: duration
change note: New property added in DCAT 2.
change note: Nová vlastnost přidaná ve verzi DCAT 2. @cs
change note: Nueva propiedad añadida en DCAT 2. @es
change note: Nuova proprietà aggiunta in DCAT 2. @it
editorial note: Kan optræde i forbindelse med beskrivelse af datasættet eller datasætditributionen, så der er ikke angivet et domæne for egenskaben. @da
editorial note: Might appear in the description of a Dataset or a Distribution, so no domain is specified.
editorial note: Může se vyskytnout v popisu Datové sady nebo Distribuce, takže nebyl specifikován definiční obor. @cs
scope note: Alternative temporal resolutions might be provided as different dataset distributions.
scope note: Alternative tidslige opløsninger kan leveres som forskellige datasætdistributioner. @da
scope note: Distintas distribuciones del conjunto de datos pueden tener resoluciones temporales diferentes. @es
scope note: Hvis datasættet er en tidsserie, så bør denne egenskab svare til afstanden mellem elementerne i tidsserien. For andre typer af datasæt indikerer denne egenskab den mindste tidsforskel mellem elementer i datasættet. @da
scope note: If the dataset is a time-series this should correspond to the spacing of items in the series. For other kinds of dataset, this property will usually indicate the smallest time difference between items in the dataset.
scope note: Pokud je datová sada časovou řadou, měla by tato vlastnost odpovídat rozestupu položek v řadě. Pro ostatní druhy datových sad bude tato vlastnost obvykle indikovat nejmenší časovou vzdálenost mezi položkami této datové sady. @cs
scope note: Risoluzioni temporali alternative potrebbero essere fornite come diverse distribuzioni di set di dati. @it
scope note: Různá časová rozlišení mohou být poskytována jako různé distribuce datové sady. @cs
scope note: Se il set di dati è una serie temporale, questo dovrebbe corrispondere alla spaziatura degli elementi della serie. Per altri tipi di set di dati, questa proprietà di solito indica la più piccola differenza di tempo tra gli elementi nel set di dati. @it
scope note: Si el conjunto de datos es una serie temporal, debe corresponder al espaciado de los elementos de la serie. Para otro tipo de conjuntos de datos, esta propiedad indicará usualmente la menor diferencia de tiempo entre elementos en el dataset. @es

theme
type: ObjectProperty
comment: A main category of the resource. A resource can have multiple themes.
comment: Et centralt emne for ressourcen. En ressource kan have flere centrale emner. @da
comment: Hlavní téma zdroje. Zdroj může mít více témat. @cs
comment: La categoria principale della risorsa. Una risorsa può avere più temi. @it
comment: La categoría principal del recurso. Un recurso puede tener varios temas. @es
comment: La catégorie principale de la ressource. Une ressource peut avoir plusieurs thèmes. @fr
comment: Η κύρια κατηγορία του συνόλου δεδομένων. Ένα σύνολο δεδομένων δύναται να έχει πολλαπλά θέματα. @el
comment: التصنيف الرئيسي لقائمة البيانات. قائمة البيانات يمكن أن تملك أكثر من تصنيف رئيسي واحد. @ar
comment: データセットの主要カテゴリー。データセットは複数のテーマを持つことができます。 @ja
label: emne @da
label: tema @es
label: thème @fr
label: téma @cs
label: Θέμα @el
label: التصنيف @ar
label: テーマ/カテゴリー @ja
sub property of: subject
editorial note: Status: English Definition text modified by DCAT revision team, all except for Italian and Czech translations are pending. Scope note has changed and its translations should be updated
scope note: El conjunto de skos:Concepts utilizados para categorizar los recursos están organizados en un skos:ConceptScheme que describe todas las categorías y sus relaciones en el catálogo. @es
scope note: Il set di concetti skos usati per categorizzare le risorse sono organizzati in skos:ConceptScheme che descrive tutte le categorie e le loro relazioni nel catalogo. @it
scope note: Sada instancí třídy skos:Concept použitá pro kategorizaci zdrojů je organizována do schématu konceptů skos:ConceptScheme, které popisuje všechny kategorie v katalogu a jejich vztahy. @cs
scope note: Samlingen af begreber (skos:Concept) der anvendes til at emneinddele ressourcer organiseres i et begrebssystem (skos:ConceptScheme) som beskriver alle emnerne og deres relationer i kataloget. @da
scope note: The set of themes used to categorize the resources are organized in a skos:ConceptScheme, skos:Collection, owl:Ontology or similar, describing all the categories and their relations in the catalog.
scope note: Un ensemble de skos:Concepts utilisés pour catégoriser les ressources sont organisés en un skos:ConceptScheme décrivant toutes les catégories et ses relations dans le catalogue. @fr
scope note: Το σετ των skos:Concepts που χρησιμοποιείται για να κατηγοριοποιήσει τα σύνολα δεδομένων είναι οργανωμένο εντός ενός skos:ConceptScheme που περιγράφει όλες τις κατηγορίες και τις σχέσεις αυτών στον κατάλογο. @el
scope note: データセットを分類するために用いられるskos:Conceptの集合は、カタログのすべてのカテゴリーとそれらの関係を記述しているskos:ConceptSchemeで組織化されます。 @ja

theme taxonomy
type: ObjectProperty
range includes: Ontology
range includes: Collection
range includes: ConceptScheme
comment: El sistema de organización del conocimiento utilizado para clasificar conjuntos de datos de catálogos. @es
comment: Il sistema di organizzazione della conoscenza (KOS) usato per classificare i dataset del catalogo. @it
comment: Le systhème d'ogranisation de connaissances utilisé pour classifier les jeux de données du catalogue. @fr
comment: Systém organizace znalostí (KOS) použitý pro klasifikaci datových sad v katalogu. @cs
comment: The knowledge organization system (KOS) used to classify catalog's datasets.
comment: Vidensorganiseringssystem (KOS) som anvendes til at klassificere datasæt i kataloget. @da
comment: Το σύστημα οργάνωσης γνώσης που χρησιμοποιείται για την κατηγοριοποίηση των συνόλων δεδομένων του καταλόγου. @el
comment: لائحة التصنيفات المستخدمه لتصنيف قوائم البيانات ضمن الفهرس @ar
comment: カタログのデータセットを分類するために用いられる知識組織化体系（KOS；knowledge organization system）。 @ja
domain: Catalog
label: emnetaksonomi @da
label: tassonomia dei temi @it
label: taxonomie de thèmes @fr
label: taxonomie témat @cs
label: taxonomía de temas @es
label: Ταξινομία θεματικών κατηγοριών. @el
label: قائمة التصنيفات @ar
label: テーマ @ja
range: Resource
alternative label: temataksonomi @da
scope note: Det anbefales at taksonomien organiseres i et skos:ConceptScheme, skos:Collection, owl:Ontology eller lignende, som giver mulighed for at ethvert medlem af taksonomien kan forsynes med en IRI og udgives som linked-data. @da
scope note: It is recommended that the taxonomy is organized in a skos:ConceptScheme, skos:Collection, owl:Ontology or similar, which allows each member to be denoted by an IRI and published as linked-data.
scope note: Je doporučeno, aby byla taxonomie vyjádřena jako skos:ConceptScheme, skos:Collection, owl:Ontology nebo podobné, aby mohla být každá položka identifikována pomocí IRI a publikována jako propojená data. @cs
scope note: Se recomienda que la taxonomía se organice como un skos:ConceptScheme, skos:Collection, owl:Ontology o similar, los cuáles permiten que cada miembro se denote con una IRI y se publique como datos enlazados. @es
scope note: Si raccomanda che la tassonomia sia organizzata in uno skos:ConceptScheme, skos:Collection, owl:Ontology o simili, che permette ad ogni membro di essere indicato da un IRI e pubblicato come linked-data. @it

version
type: DatatypeProperty
comment: El indicador de versión (nombre o identificador) del recurso. @es
comment: L'indicatore di versione (un nome o un identificatore) di una risorsa. @it
comment: The version indicator (name or identifier) of a resource.
label: versione @it
label: versión @es
change note: New property added in DCAT 3.
change note: Nová vlastnost přidaná ve verzi DCAT 3. @cs
change note: Nueva propiedad agregada in DCAT 3. @es
change note: Nuova proprietà aggiunta in DCAT 3. @it
change note: Ny egenskab tilføjet i DCAT 3. @da
definition: L'indicatore di versione (un nome o un identificatore) di una risorsa @it
scope note: DCAT does not prescribe how a version name / identifier should be specified, and refers for guidance to [DWBP]'s Best Practice 7: Provide a version indicator.
scope note: DCAT no prescribe cómo especificar el nombre or identificador de una versión, y como guía sugiere leer las práctica 7 en [DWBP] sobre cómo proveer un indicador de versión @es
scope note: DCAT non prescrive come un nome o identificatore di versione dovrebbe essere specificato, e fa riferimento alle linee guida indicate in [DWBP] Best Practice 7: Provide a version indicator. @it

Data Quality Vocabulary
type: NamedIndividual
type: Vocabulary
contributor: Jeremy Debattista
contributor: Christophe Guéret
contributor: Makx Dekkers
contributor: Nandana Mihindukulasooriya
contributor: Deirdre Lee
contributor: Amrapali Zaveri
created: 2015-12-17
creator: Riccardo Albertoni
creator: Antoine Isaac
description: The Data Quality Vocabulary (DQV) is seen as an extension to DCAT to cover the quality of the data, how frequently is it updated, whether it accepts user corrections, persistence commitments etc. When used by publishers, this vocabulary will foster trust in the data amongst developers.
modified: 2016-08-26
publisher: W3C
type: Ontology
preferred namespace prefix: dqv
preferred namespace uri: http://www.w3.org/ns/dqv#

Category
type: Class
comment: Represents a group of quality dimensions in which a common type of information is used as quality indicator.
subclass of: Concept

Dimension
type: Class
comment: Represents criteria relevant for assessing quality. Each quality dimension must have one or more metric to measure it. A dimension is linked with a category using the dqv:inCategory property.
subclass of: Concept

Metric
type: Class
comment: Represents a standard to measure a quality dimension. An observation (instance of dqv:QualityMeasurement) assigns a value in a given unit to a Metric.

Quality Annotation
type: Class
comment: Represents quality annotations, including ratings, quality certificates or feedback that can be associated to datasets or distributions. Quality annotations must have one oa:motivatedBy statement with an instance of oa:Motivation (and skos:Concept) that reflects a quality assessment purpose. We define this instance as dqv:qualityAssessment.
subclass of: Annotation
equivalent class: Restriction
  has value: Quality assessment
  on property: motivation

Quality Certificate
type: Class
comment: An annotation that associates a resource (especially, a dataset or a distribution) to another resource (for example, a document) that certifies the resource's quality according to a set of quality assessment rules.
subclass of: Quality Annotation

Quality Measurement
type: Class
usage note: The unit of measure in quality measurement should be specified through the property sdmx-attribute:unitMeasure as recommended by RDF Data Cube. The Ontology of units of Measure (OM) by Rijgersberg Et Al provides a list of HTTP dereferenceable unit of measures, which can be exploited as values for sdmx-attribute:unitMeasure.
comment: Represents the evaluation of a given dataset (or dataset distribution) against a specific quality metric.
subclass of: Observation

Quality Measurement Dataset
type: Class
comment: Represents a dataset of quality measurements, evaluations of one or more datasets (or dataset distributions) against specific quality metrics.
subclass of: DataSet

Quality Metadata
type: Class
usage note: QualityMetadata containers do not necessary include all types of quality statements DQV can support. Implementers decide the granularity of containment. In the current version of DQV, we also leave open the choice of the containment technique. Implementers can use (RDF) graph containment. They may also use an appropriate property of their choice — for example (a subproperty of) dcterms:hasPart — to link instances of dqv:QualityMetadata with instances of other DQV classes.
comment: Represents quality metadata, it is defined to group quality certificates, policies, measurements and annotations under a named graph.
subclass of: Graph

Quality Policy
type: Class
comment: Represents a policy or agreement that is chiefly governed by data quality concerns.

User Quality feedback
type: Class
comment: Represents feedback that users have on the quality of datasets or distributions. Besides dqv:qualityAssessment, which is the motivation required by all quality annotations, one of the predefined instances of oa:Motivation should be indicated as motivation to distinguish among the different kinds of feedback, e.g., classifications, questions.
subclass of: Quality Annotation
subclass of: User Feedback

computed on
type: ObjectProperty
type: NamedIndividual
type: DimensionProperty
comment: Refers to the resource (e.g., a dataset, a linkset, a graph, a set of triples) on which the quality measurement is performed. In the DQV context, this property is generally expected to be used in statements in which objects are instances of dcat:Dataset or dcat:Distribution.
domain: Quality Measurement
range: Resource
inverse of: has quality measurement

expected data type
type: DatatypeProperty
comment: Represents the expected data type for metric's observed value (e.g. xsd:boolean, xsd:double etc...)
domain: Metric
range: anySimpleType

has quality annotation
type: ObjectProperty
comment: Refers to a quality annotation. Quality annotation can be applied to any kind of resource, e.g., a dataset, a linkset, a graph, a set of triples. However, in the DQV context, this property is generally expected to be used in statements in which subjects are instances of dcat:Dataset or dcat:Distribution.
range: Quality Annotation
sub property of:
  inverse of: hasTarget

has quality measurement
type: ObjectProperty
comment: Refers to the performed quality measurements. Quality measurements can be performed to any kind of resource (e.g., a dataset, a linkset, a graph, a set of triples). However, in the DQV context, this property is generally expected to be used in statements in which subjects are instances of dcat:Dataset or dcat:Distribution.
range: Quality Measurement

has quality metadata
type: ObjectProperty
comment: Refers to a grouping of quality information such as certificates, policies, measurements and annotations as a named graph. Quality information represented in such a grouping can pertain to any kind of resource (e.g., a dataset, a linkset, a graph, a set of triples). However, in the DQV context, this property is generally expected to be used in statements in which subjects are instances of dcat:Dataset or dcat:Distribution.
range: Quality Metadata

in category
type: ObjectProperty
usage note: Categories are meant to systematically organize dimensions. The Data Quality Vocabulary defines no specific cardinality constraints for dqv:inCategory, since distinct quality frameworks might have different perspectives over a dimension. A dimension may therefore be associated to more than one category. However, those who define new quality metrics should try to avoid this as much as possible and assign only one category to the dimensions they define.
comment: Represents the category a dimension is grouped in.
domain: Dimension
range: Category

in dimension
type: ObjectProperty
usage note: Dimensions are meant to systematically organize metrics, quality certificates and quality annotations. The Data Quality Vocabulary defines no specific cardinality constraints for dqv:inDimension, since distinct quality frameworks might have different perspectives over a metric. A metric may therefore be associated to more than one dimension. However, those who define new quality metrics should try to avoid this as much as possible and assign only one dimension to the metrics they define. More than one dimension can be indicated for each quality annotation or certificate.
comment: Represents the dimensions a quality metric, certificate and annotation allow a measurement of.
range: Dimension

is measurement of
type: ObjectProperty
type: NamedIndividual
type: DimensionProperty
comment: Indicates the metric being observed.
domain: Observation
range: Metric

Precision
type: NamedIndividual
type: Dimension
definition: Precision is a quality dimension, which refers to the recorded level of details. It represents the exactness of a measurement or description. It is equivalent the notion of Precision from ISO 25012.

Quality assessment
type: NamedIndividual
type: Motivation
usage note: Whenever DQV implementers need to extend the motivations for quality annotations, they should follow the instructions provided by the Web Annotation Data Model, and the concepts in the extension should be defined as specializations of dqv:qualityAssessment.
broader: assessing
definition: Motivation that must be specified for quality annotations.

value
type: DatatypeProperty
type: NamedIndividual
type: MeasureProperty
comment: Refers to values computed by metric.
domain: Quality Measurement

Dataset Usage Vocabulary
type: NamedIndividual
type: Vocabulary
created: 2015-12-17
creator: Bernadette Farias Lóscio
creator: Sumit Purohit
creator: Eric G. Stephan
description: The Dataset Usage Vocabulary (DUV) is used to describe consumer experiences, citations, and feedback about datasets from the human perspective.
modified: 2016-08-30
modified: 2017-01-23
publisher: W3C
type: Ontology
preferred namespace prefix: duv
preferred namespace uri: http://www.w3.org/ns/duv#

Rating Feedback
type: Class
comment: Predefined criteria used to express a user opinion about a dataset or distribution using a discrete range of values.

Usage
type: Class
comment: A helpful description of actions that can be performed on a given dataset or distribution.

UsageTool
type: Class
comment: A synopsis describing the way a tool can use a dataset or distribution.

User Feedback
type: Class
comment: User feedback on the dataset. Expresses whether the dataset was useful or not, for example.

has distributor
type: ObjectProperty
usage note: dcat:Dataset (subject) duv:hasDistributor (predicate) foaf:Agent (object)
usage note: dcat:Distribution (subject) duv:hasDistributor (predicate) foaf:Agent (object)
comment: The distributor is the organization that makes the dataset available for downloading and use.
range: Agent

has dataset feedback
type: ObjectProperty
usage note: dcat:Dataset (subject) duv:hasFeedback (predicate) duv:UserFeedback (object)
usage note: dcat:Distribution (subject) duv:hasFeedback (predicate) duv:UserFeedback (object)
comment: User feedback associated with Dataset or distribution
range: User Feedback

has rating
type: ObjectProperty
comment: Rating Feedback has rating opinion
domain: Rating Feedback
range: Concept

has dataset/distribution usage
type: ObjectProperty
comment: Dataset/distribution usage guidance or instructions.
range: Usage

has usage tool
type: ObjectProperty
comment: Describes the tool that provides the Usage
domain: Usage
range: UsageTool

refers to dataset
type: ObjectProperty
comment: Dataset associated with Usage.
domain: Usage
range: Dataset

homepage
type: ObjectProperty
comment: Este axioma se necesita de manera que Protege cargue DCAT3 sin problemas. @es
comment: This axiom needed so that Protege loads DCAT 3 without errors.

primaryTopic
type: ObjectProperty
comment: Este axioma se necesita de manera que Protege cargue DCAT 3 sin problemas. @es
comment: This axiom needed so that Protege loads DCAT 3 without errors.

Dataset Framework Ontology (DATA-FW)
type: Ontology
created: 2024-02-01
description: DATA-FW has been developed as part of the MOCK-UP PhD project, which aims to enhance the FAIRness of domain datasets and facilitate dataset discovery by utilizing the characteristics of these datasets to meet user needs. This vocabulary dataset is intended to describe datasets using standard vocabularies, namely the DCAT and RDF Data Cube. Additionally, it will soon incorporate a vocabulary for expressing user needs and another for evaluating data quality.
license: https://creativecommons.org/licenses/by/4.0/
imports: cube
imports: core
imports: prov-o#
imports: http://xmlns.com/foaf/0.1/
version IRI: https://w3id.org/data-fw/1.0.0
version info: 1.0.0

Data set
type: Class
comment: A data set (or dataset) is a collection of data. In the case of tabular data, a data set corresponds to one or more database tables, where every column of a table represents a particular variable, and each row corresponds to a given record of the data set in question. The data set lists values for each of the variables, such as for example height and weight of an object, for each member of the data set. Data sets can also consist of a collection of documents or files. In the open data discipline, data set is the unit to measure the information released in a public open data repository. The European data.europa.eu portal aggregates more than a million data sets. Wikipedia contributors. (2024, January 23). Data set. In Wikipedia, The Free Encyclopedia. Retrieved 11:40, February 14, 2024, from https://en.wikipedia.org/w/index.php?title=Data_set&oldid=1198181143